BDBM50181982 CHEMBL208042::N-(3-methoxyphenyl)-7-(pyridin-2-yl)-7H-pyrrolo[2,3-d]pyrimidin-2-amine
SMILES: COc1cccc(Nc2ncc3ccn(-c4ccccn4)c3n2)c1
InChI Key: InChIKey=GLCNFABDISMPSM-UHFFFAOYSA-N
Data: 1 IC50
Activity Spreadsheet -- Enzyme Inhibition Constant Data from BindingDB
Found 1 hit for monomerid = 50181982
Trg + Lig
Ki
nM
ΔG°
kcal/mole
IC50
nM
Kd
nM
EC50/IC50
nM
koff
s-1
kon
M-1s-1
pHTemp
°C
Focal adhesion kinase 1
(Homo sapiens (Human))
BDBM50181982
(CHEMBL208042 | N-(3-methoxyphenyl)-7-(pyridin-2-yl...)
Show SMILES COc1cccc(Nc2ncc3ccn(-c4ccccn4)c3n2)c1
Show InChI InChI=1S/C18H15N5O/c1-24-15-6-4-5-14(11-15)21-18-20-12-13-8-10-23(17(13)22-18)16-7-2-3-9-19-16/h2-12H,1H3,(H,20,21,22)
NCI pathway
Reactome pathway
n/an/a 600n/an/an/an/an/an/a
Genomics Institute of the Novartis Research Foundation (GNF)
Curated by ChEMBL
Assay Description
Inhibitory activity against FAK
Bioorg Med Chem Lett 16: 2173-6 (2006)
Article DOI: 10.1016/j.bmcl.2006.01.053
BindingDB Entry DOI: 10.7270/Q2319VGX
3D
3D Structure (docked)