null
SMILES: CC(C)c1ccccc1Nc1ncc2ccn(-c3ccccn3)c2n1
InChI Key: InChIKey=CTWFTOJSXMFECA-UHFFFAOYSA-N
Activity Spreadsheet -- Enzyme Inhibition Constant Data from BindingDB
Found 1 hit for monomerid = 50181984
Trg + Lig
Ki
nM
ΔG°
kcal/mole
IC50
nM
Kd
nM
EC50/IC50
nM
koff
s-1
kon
M-1s-1
pHTemp
°C
Focal adhesion kinase 1
(Homo sapiens (Human))
BDBM50181984
(CHEMBL380116 | N-(2-isopropylphenyl)-7-(pyridin-2-...)
Show SMILES CC(C)c1ccccc1Nc1ncc2ccn(-c3ccccn3)c2n1
Show InChI InChI=1S/C20H19N5/c1-14(2)16-7-3-4-8-17(16)23-20-22-13-15-10-12-25(19(15)24-20)18-9-5-6-11-21-18/h3-14H,1-2H3,(H,22,23,24)
NCI pathway
Reactome pathway
n/an/a>1.00E+4n/an/an/an/an/an/a
Genomics Institute of the Novartis Research Foundation (GNF)
Curated by ChEMBL
Assay Description
Inhibitory activity against FAK
Bioorg Med Chem Lett 16: 2173-6 (2006)
Article DOI: 10.1016/j.bmcl.2006.01.053
BindingDB Entry DOI: 10.7270/Q2319VGX