BDBM50182068 CHEMBL208376::N-{2-[2-(5-bromo-2-methoxy-phenyl)-ethyl]-thiophene-3-carbonyl}-N'-(4-diethylamino-1-methyl-butyl)-guanidine
SMILES: CCN(CC)CCCC(C)N=C(N)NC(=O)c1ccsc1CCc1cc(Br)ccc1OC
InChI Key: InChIKey=VDBJJOHSJHJQLM-UHFFFAOYSA-N
Data: 1 KI  1 IC50
Activity Spreadsheet -- Enzyme Inhibition Constant Data from BindingDB
Found 2 hits for monomerid = 50182068
Trg + Lig
Ki
nM
ΔG°
kcal/mole
IC50
nM
Kd
nM
EC50/IC50
nM
koff
s-1
kon
M-1s-1
pHTemp
°C
Melanocortin receptor 4
(Homo sapiens (Human))
BDBM50182068
(CHEMBL208376 | N-{2-[2-(5-bromo-2-methoxy-phenyl)-...)
Show SMILES CCN(CC)CCCC(C)N=C(N)NC(=O)c1ccsc1CCc1cc(Br)ccc1OC |w:10.9|
Show InChI InChI=1S/C24H35BrN4O2S/c1-5-29(6-2)14-7-8-17(3)27-24(26)28-23(30)20-13-15-32-22(20)12-9-18-16-19(25)10-11-21(18)31-4/h10-11,13,15-17H,5-9,12,14H2,1-4H3,(H3,26,27,28,30)
11n/an/an/an/an/an/an/an/a
Millennium Pharmaceuticals, Inc.
Curated by ChEMBL
Assay Description
Binding affinity to MC4R by membrane filtration assay
Bioorg Med Chem Lett 16: 2302-5 (2006)
Article DOI: 10.1016/j.bmcl.2006.01.016
BindingDB Entry DOI: 10.7270/Q2PV6JZW
Melanocortin receptor 4
(Homo sapiens (Human))
BDBM50182068
(CHEMBL208376 | N-{2-[2-(5-bromo-2-methoxy-phenyl)-...)
Show SMILES CCN(CC)CCCC(C)N=C(N)NC(=O)c1ccsc1CCc1cc(Br)ccc1OC |w:10.9|
Show InChI InChI=1S/C24H35BrN4O2S/c1-5-29(6-2)14-7-8-17(3)27-24(26)28-23(30)20-13-15-32-22(20)12-9-18-16-19(25)10-11-21(18)31-4/h10-11,13,15-17H,5-9,12,14H2,1-4H3,(H3,26,27,28,30)
n/an/a 260n/an/an/an/an/an/a
Millennium Pharmaceuticals, Inc.
Curated by ChEMBL
Assay Description
Antagonist activity against MC4R by cAMP functional assay
Bioorg Med Chem Lett 16: 2302-5 (2006)
Article DOI: 10.1016/j.bmcl.2006.01.016
BindingDB Entry DOI: 10.7270/Q2PV6JZW