BDBM50182107 4-(1-(3-(3-(4-bromophenyl)-5-(methylsulfonyl)-4,5,6,7-tetrahydropyrazolo[4,3-c]pyridin-1-yl)-2-hydroxypropyl)piperidin-4-yl)-6-chloro-2H-benzo[b][1,4]oxazin-3(4H)-one::CHEMBL206067
SMILES: CS(=O)(=O)N1CCc2c(C1)c(nn2CC(O)CN1CCC(CC1)N1C(=O)COc2ccc(Cl)cc12)-c1ccc(Br)cc1
InChI Key: InChIKey=SKERAAMRWSRRMF-UHFFFAOYSA-N
Data: 2 IC50
Activity Spreadsheet -- Enzyme Inhibition Constant Data from BindingDB
Found 2 hits for monomerid = 50182107
Trg + Lig
Ki
nM
ΔG°
kcal/mole
IC50
nM
Kd
nM
EC50/IC50
nM
koff
s-1
kon
M-1s-1
pHTemp
°C
Cathepsin S
(Homo sapiens (Human))
BDBM50182107
(4-(1-(3-(3-(4-bromophenyl)-5-(methylsulfonyl)-4,5,...)
Show SMILES CS(=O)(=O)N1CCc2c(C1)c(nn2CC(O)CN1CCC(CC1)N1C(=O)COc2ccc(Cl)cc12)-c1ccc(Br)cc1
Show InChI InChI=1S/C29H33BrClN5O5S/c1-42(39,40)34-13-10-25-24(17-34)29(19-2-4-20(30)5-3-19)32-35(25)16-23(37)15-33-11-8-22(9-12-33)36-26-14-21(31)6-7-27(26)41-18-28(36)38/h2-7,14,22-23,37H,8-13,15-18H2,1H3
Reactome pathway
n/an/a 48n/an/an/an/an/an/a
Johnson and Johnson Pharmaceutical Research and Development
Curated by ChEMBL
Assay Description
Inhibition of cathepsin S
Bioorg Med Chem Lett 16: 2209-12 (2006)
Article DOI: 10.1016/j.bmcl.2006.01.038
BindingDB Entry DOI: 10.7270/Q2K35T7W
HLA-DR antigens-associated invariant chain
(Homo sapiens (Human))
BDBM50182107
(4-(1-(3-(3-(4-bromophenyl)-5-(methylsulfonyl)-4,5,...)
Show SMILES CS(=O)(=O)N1CCc2c(C1)c(nn2CC(O)CN1CCC(CC1)N1C(=O)COc2ccc(Cl)cc12)-c1ccc(Br)cc1
Show InChI InChI=1S/C29H33BrClN5O5S/c1-42(39,40)34-13-10-25-24(17-34)29(19-2-4-20(30)5-3-19)32-35(25)16-23(37)15-33-11-8-22(9-12-33)36-26-14-21(31)6-7-27(26)41-18-28(36)38/h2-7,14,22-23,37H,8-13,15-18H2,1H3
Reactome pathway
n/an/a 4.40E+3n/an/an/an/an/an/a
Johnson and Johnson Pharmaceutical Research and Development
Curated by ChEMBL
Assay Description
Inhibition of MHC2 invariant chain
Bioorg Med Chem Lett 16: 2209-12 (2006)
Article DOI: 10.1016/j.bmcl.2006.01.038
BindingDB Entry DOI: 10.7270/Q2K35T7W