BDBM50182268 CHEMBL3819480
SMILES: Oc1c(NC(=O)Nc2cccc(F)c2Cl)ccc(Cl)c1S(=O)(=O)C1CCCCC1
InChI Key: InChIKey=FWUMHIMURFXCFH-UHFFFAOYSA-N
Data: 2 IC50
Activity Spreadsheet -- Enzyme Inhibition Constant Data from BindingDB
Found 2 hits for monomerid = 50182268
Trg + Lig
Ki
nM
ΔG°
kcal/mole
IC50
nM
Kd
nM
EC50/IC50
nM
koff
s-1
kon
M-1s-1
pHTemp
°C
C-X-C chemokine receptor type 2
(Homo sapiens (Human))
BDBM50182268
(CHEMBL3819480)
Show SMILES Oc1c(NC(=O)Nc2cccc(F)c2Cl)ccc(Cl)c1S(=O)(=O)C1CCCCC1
Show InChI InChI=1S/C19H19Cl2FN2O4S/c20-12-9-10-15(24-19(26)23-14-8-4-7-13(22)16(14)21)17(25)18(12)29(27,28)11-5-2-1-3-6-11/h4,7-11,25H,1-3,5-6H2,(H2,23,24,26)
Reactome pathway
n/an/a 79n/an/an/an/an/an/a
Peking Union Medical College and Chinese Academy of Medical Sciences
Curated by ChEMBL
Assay Description
Antagonist activity at human recombinant CXCR2 assessed as inhibition of CXCL1-induced neutrophil chemotaxis after 45 mins by calcein-AM dye based pl...
ACS Med Chem Lett 7: 397-402 (2016)
BindingDB Entry DOI: 10.7270/Q2KW5HZH
C-X-C chemokine receptor type 2
(Homo sapiens (Human))
BDBM50182268
(CHEMBL3819480)
Show SMILES Oc1c(NC(=O)Nc2cccc(F)c2Cl)ccc(Cl)c1S(=O)(=O)C1CCCCC1
Show InChI InChI=1S/C19H19Cl2FN2O4S/c20-12-9-10-15(24-19(26)23-14-8-4-7-13(22)16(14)21)17(25)18(12)29(27,28)11-5-2-1-3-6-11/h4,7-11,25H,1-3,5-6H2,(H2,23,24,26)
Reactome pathway
n/an/a 0.316n/an/an/an/an/an/a
Peking Union Medical College and Chinese Academy of Medical Sciences
Curated by ChEMBL
Assay Description
Antagonist activity at human recombinant Gal4-VP16 fused-CXCR2 assessed as inhibition of CXCL1-mediated lactamase reporter gene expression after over...
ACS Med Chem Lett 7: 397-402 (2016)
BindingDB Entry DOI: 10.7270/Q2KW5HZH