BDBM50182332 2-(5-(4-(furan-2-yl)phenyl)-3-(trifluoromethyl)-1H-pyrazol-1-yl)-5-(methylsulfonyl)pyridine::CHEMBL206359
SMILES: CS(=O)(=O)c1ccc(nc1)-n1nc(cc1-c1ccc(cc1)-c1ccco1)C(F)(F)F
InChI Key: InChIKey=HCLGXDHCVCVCTP-UHFFFAOYSA-N
Data: 2 IC50
Activity Spreadsheet -- Enzyme Inhibition Constant Data from BindingDB
Found 2 hits for monomerid = 50182332
Trg + Lig
Ki
nM
ΔG°
kcal/mole
IC50
nM
Kd
nM
EC50/IC50
nM
koff
s-1
kon
M-1s-1
pHTemp
°C
Cyclooxygenase-2
(Canis familiaris)
BDBM50182332
(2-(5-(4-(furan-2-yl)phenyl)-3-(trifluoromethyl)-1H...)
Show SMILES CS(=O)(=O)c1ccc(nc1)-n1nc(cc1-c1ccc(cc1)-c1ccco1)C(F)(F)F
Show InChI InChI=1S/C20H14F3N3O3S/c1-30(27,28)15-8-9-19(24-12-15)26-16(11-18(25-26)20(21,22)23)13-4-6-14(7-5-13)17-3-2-10-29-17/h2-12H,1H3
Reactome pathway
n/an/a 20n/an/an/an/an/an/a
Veterinary Medicine Research and Development Pfizer Inc.
Curated by ChEMBL
Assay Description
Inhibition of COX2 in canine whole blood
Bioorg Med Chem Lett 16: 2076-80 (2006)
Article DOI: 10.1016/j.bmcl.2006.01.059
BindingDB Entry DOI: 10.7270/Q28K78PW
Cyclooxygenase-1
(Canis familiaris)
BDBM50182332
(2-(5-(4-(furan-2-yl)phenyl)-3-(trifluoromethyl)-1H...)
Show SMILES CS(=O)(=O)c1ccc(nc1)-n1nc(cc1-c1ccc(cc1)-c1ccco1)C(F)(F)F
Show InChI InChI=1S/C20H14F3N3O3S/c1-30(27,28)15-8-9-19(24-12-15)26-16(11-18(25-26)20(21,22)23)13-4-6-14(7-5-13)17-3-2-10-29-17/h2-12H,1H3
Reactome pathway
n/an/a 1.82E+4n/an/an/an/an/an/a
Veterinary Medicine Research and Development Pfizer Inc.
Curated by ChEMBL
Assay Description
Inhibition of COX1 in canine whole blood
Bioorg Med Chem Lett 16: 2076-80 (2006)
Article DOI: 10.1016/j.bmcl.2006.01.059
BindingDB Entry DOI: 10.7270/Q28K78PW