BDBM50182345 2-(5-(3-methyl-4-(oxazol-4-yl)phenyl)-3-(trifluoromethyl)-1H-pyrazol-1-yl)-5-(methylsulfonyl)pyridine::CHEMBL381834
SMILES: Cc1cc(ccc1-c1cocn1)-c1cc(nn1-c1ccc(cn1)S(C)(=O)=O)C(F)(F)F
InChI Key: InChIKey=ABPKHTIKJVSNLN-UHFFFAOYSA-N
Data: 2 IC50
Activity Spreadsheet -- Enzyme Inhibition Constant Data from BindingDB
Found 2 hits for monomerid = 50182345
Trg + Lig
Ki
nM
ΔG°
kcal/mole
IC50
nM
Kd
nM
EC50/IC50
nM
koff
s-1
kon
M-1s-1
pHTemp
°C
Cyclooxygenase-2
(Canis familiaris)
BDBM50182345
(2-(5-(3-methyl-4-(oxazol-4-yl)phenyl)-3-(trifluoro...)
Show SMILES Cc1cc(ccc1-c1cocn1)-c1cc(nn1-c1ccc(cn1)S(C)(=O)=O)C(F)(F)F
Show InChI InChI=1S/C20H15F3N4O3S/c1-12-7-13(3-5-15(12)16-10-30-11-25-16)17-8-18(20(21,22)23)26-27(17)19-6-4-14(9-24-19)31(2,28)29/h3-11H,1-2H3
Reactome pathway
n/an/a 30n/an/an/an/an/an/a
Veterinary Medicine Research and Development Pfizer Inc.
Curated by ChEMBL
Assay Description
Inhibition of COX2 in canine whole blood
Bioorg Med Chem Lett 16: 2076-80 (2006)
Article DOI: 10.1016/j.bmcl.2006.01.059
BindingDB Entry DOI: 10.7270/Q28K78PW
Cyclooxygenase-1
(Canis familiaris)
BDBM50182345
(2-(5-(3-methyl-4-(oxazol-4-yl)phenyl)-3-(trifluoro...)
Show SMILES Cc1cc(ccc1-c1cocn1)-c1cc(nn1-c1ccc(cn1)S(C)(=O)=O)C(F)(F)F
Show InChI InChI=1S/C20H15F3N4O3S/c1-12-7-13(3-5-15(12)16-10-30-11-25-16)17-8-18(20(21,22)23)26-27(17)19-6-4-14(9-24-19)31(2,28)29/h3-11H,1-2H3
Reactome pathway
n/an/a 1.27E+4n/an/an/an/an/an/a
Veterinary Medicine Research and Development Pfizer Inc.
Curated by ChEMBL
Assay Description
Inhibition of COX1 in canine whole blood
Bioorg Med Chem Lett 16: 2076-80 (2006)
Article DOI: 10.1016/j.bmcl.2006.01.059
BindingDB Entry DOI: 10.7270/Q28K78PW