BDBM50182367 4-(2-(4-fluorophenyl)-7-(piperidin-4-yl)H-imidazo[1,2-a]pyridin-3-yl)pyrimidin-2-amine::4-[2-(4-Fluorophenyl)-7-piperidin-4-ylimidazo-[1,2-a]pyridin-3-yl]piperidin-2-ylamine::CHEMBL207476
SMILES: Nc1nccc(n1)-c1c(nc2cc(ccn12)C1CCNCC1)-c1ccc(F)cc1
InChI Key: InChIKey=XLJZIYPUEKTXOQ-UHFFFAOYSA-N
Data: 2 IC50
Activity Spreadsheet -- Enzyme Inhibition Constant Data from BindingDB
Found 2 hits for monomerid = 50182367
Trg + Lig
Ki
nM
ΔG°
kcal/mole
IC50
nM
Kd
nM
EC50/IC50
nM
koff
s-1
kon
M-1s-1
pHTemp
°C
cGMP-dependent protein kinase
(Eimeria tenella)
BDBM50182367
(4-(2-(4-fluorophenyl)-7-(piperidin-4-yl)H-imidazo[...)
Show SMILES Nc1nccc(n1)-c1c(nc2cc(ccn12)C1CCNCC1)-c1ccc(F)cc1
Show InChI InChI=1S/C22H21FN6/c23-17-3-1-15(2-4-17)20-21(18-7-11-26-22(24)27-18)29-12-8-16(13-19(29)28-20)14-5-9-25-10-6-14/h1-4,7-8,11-14,25H,5-6,9-10H2,(H2,24,26,27)
n/an/a 0.0460n/an/an/an/an/an/a
SCYNEXIS, Inc.
Curated by ChEMBL
Assay Description
Inhibition of Eimeria tenella cGMP-dependent protein kinase
Eur J Med Chem 43: 1123-51 (2008)
Article DOI: 10.1016/j.ejmech.2007.09.013
BindingDB Entry DOI: 10.7270/Q28C9W1H
cGMP-dependent protein kinase
(Eimeria tenella)
BDBM50182367
(4-(2-(4-fluorophenyl)-7-(piperidin-4-yl)H-imidazo[...)
Show SMILES Nc1nccc(n1)-c1c(nc2cc(ccn12)C1CCNCC1)-c1ccc(F)cc1
Show InChI InChI=1S/C22H21FN6/c23-17-3-1-15(2-4-17)20-21(18-7-11-26-22(24)27-18)29-12-8-16(13-19(29)28-20)14-5-9-25-10-6-14/h1-4,7-8,11-14,25H,5-6,9-10H2,(H2,24,26,27)
n/an/a 0.0500n/an/an/an/an/an/a
Merck Research Laboratories
Curated by ChEMBL
Assay Description
Inhibitory activity against PKG
Bioorg Med Chem Lett 16: 2479-83 (2006)
Article DOI: 10.1016/j.bmcl.2006.01.092
BindingDB Entry DOI: 10.7270/Q24X57CW