BDBM50182758 CHEMBL3819243
SMILES: Cl.Fc1cc(ccc1Cl)[C@@H]1OCCNC[C@H]1Cn1ncccc1=O
InChI Key: InChIKey=RAGSPMSOSRCRII-MIRNQTQTSA-N
Data: 3 IC50
Activity Spreadsheet -- Enzyme Inhibition Constant Data from BindingDB
Found 3 hits for monomerid = 50182758
Trg + Lig
Ki
nM
ΔG°
kcal/mole
IC50
nM
Kd
nM
EC50/IC50
nM
koff
s-1
kon
M-1s-1
pHTemp
°C
Sodium-dependent noradrenaline transporter
(Homo sapiens (Human))
BDBM50182758
(CHEMBL3819243)
Show SMILES Cl.Fc1cc(ccc1Cl)[C@@H]1OCCNC[C@H]1Cn1ncccc1=O |r|
Show InChI InChI=1S/C16H17ClFN3O2.ClH/c17-13-4-3-11(8-14(13)18)16-12(9-19-6-7-23-16)10-21-15(22)2-1-5-20-21;/h1-5,8,12,16,19H,6-7,9-10H2;1H/t12-,16-;/m0./s1
Reactome pathway
n/an/a 0.0650n/an/an/an/an/an/a
Takeda Pharmaceutical Company Ltd
Curated by ChEMBL
Assay Description
Inhibition of human NET expressed in CHO cells assessed as [3H]-Norepinephrine reuptake incubated for 45 mins measured after 30 mins by topcount meth...
Bioorg Med Chem 24: 3716-26 (2016)
BindingDB Entry DOI: 10.7270/Q2NP26B4
Sodium-dependent dopamine transporter
(Homo sapiens (Human))
BDBM50182758
(CHEMBL3819243)
Show SMILES Cl.Fc1cc(ccc1Cl)[C@@H]1OCCNC[C@H]1Cn1ncccc1=O |r|
Show InChI InChI=1S/C16H17ClFN3O2.ClH/c17-13-4-3-11(8-14(13)18)16-12(9-19-6-7-23-16)10-21-15(22)2-1-5-20-21;/h1-5,8,12,16,19H,6-7,9-10H2;1H/t12-,16-;/m0./s1
NCI pathway
Reactome pathway
n/an/a 240n/an/an/an/an/an/a
Takeda Pharmaceutical Company Ltd
Curated by ChEMBL
Assay Description
Inhibition of human DAT expressed in CHO cells assessed as [3H]-dopamine reuptake incubated for 60 mins measured after 30 mins by topcount method
Bioorg Med Chem 24: 3716-26 (2016)
BindingDB Entry DOI: 10.7270/Q2NP26B4
Sodium-dependent serotonin transporter
(Homo sapiens (Human))
BDBM50182758
(CHEMBL3819243)
Show SMILES Cl.Fc1cc(ccc1Cl)[C@@H]1OCCNC[C@H]1Cn1ncccc1=O |r|
Show InChI InChI=1S/C16H17ClFN3O2.ClH/c17-13-4-3-11(8-14(13)18)16-12(9-19-6-7-23-16)10-21-15(22)2-1-5-20-21;/h1-5,8,12,16,19H,6-7,9-10H2;1H/t12-,16-;/m0./s1
n/an/a 79n/an/an/an/an/an/a
Takeda Pharmaceutical Company Ltd
Curated by ChEMBL
Assay Description
Inhibition of human SERT expressed in CHO cells assessed as [3H]-5-hydroxytryptamine reuptake incubated for 20 mins measured after 30 mins by topcoun...
Bioorg Med Chem 24: 3716-26 (2016)
BindingDB Entry DOI: 10.7270/Q2NP26B4