BDBM50182763 CHEMBL3818901
SMILES: Cl.COC(=O)c1cccn(C[C@@H]2CNCCO[C@H]2c2ccc(Cl)c(F)c2)c1=O
InChI Key: InChIKey=DKYROPSEFKOOAQ-KYLFUZKPSA-N
Data: 3 IC50
Activity Spreadsheet -- Enzyme Inhibition Constant Data from BindingDB
Found 3 hits for monomerid = 50182763
Trg + Lig
Ki
nM
ΔG°
kcal/mole
IC50
nM
Kd
nM
EC50/IC50
nM
koff
s-1
kon
M-1s-1
pHTemp
°C
Sodium-dependent noradrenaline transporter
(Homo sapiens (Human))
BDBM50182763
(CHEMBL3818901)
Show SMILES Cl.COC(=O)c1cccn(C[C@@H]2CNCCO[C@H]2c2ccc(Cl)c(F)c2)c1=O |r|
Show InChI InChI=1S/C19H20ClFN2O4.ClH/c1-26-19(25)14-3-2-7-23(18(14)24)11-13-10-22-6-8-27-17(13)12-4-5-15(20)16(21)9-12;/h2-5,7,9,13,17,22H,6,8,10-11H2,1H3;1H/t13-,17-;/m0./s1
Reactome pathway
n/an/a 0.210n/an/an/an/an/an/a
Takeda Pharmaceutical Company Ltd
Curated by ChEMBL
Assay Description
Inhibition of human NET expressed in CHO cells assessed as [3H]-Norepinephrine reuptake incubated for 45 mins measured after 30 mins by topcount meth...
Bioorg Med Chem 24: 3716-26 (2016)
BindingDB Entry DOI: 10.7270/Q2NP26B4
Sodium-dependent dopamine transporter
(Homo sapiens (Human))
BDBM50182763
(CHEMBL3818901)
Show SMILES Cl.COC(=O)c1cccn(C[C@@H]2CNCCO[C@H]2c2ccc(Cl)c(F)c2)c1=O |r|
Show InChI InChI=1S/C19H20ClFN2O4.ClH/c1-26-19(25)14-3-2-7-23(18(14)24)11-13-10-22-6-8-27-17(13)12-4-5-15(20)16(21)9-12;/h2-5,7,9,13,17,22H,6,8,10-11H2,1H3;1H/t13-,17-;/m0./s1
NCI pathway
Reactome pathway
n/an/a>1.00E+3n/an/an/an/an/an/a
Takeda Pharmaceutical Company Ltd
Curated by ChEMBL
Assay Description
Inhibition of human DAT expressed in CHO cells assessed as [3H]-dopamine reuptake incubated for 60 mins measured after 30 mins by topcount method
Bioorg Med Chem 24: 3716-26 (2016)
BindingDB Entry DOI: 10.7270/Q2NP26B4
Sodium-dependent serotonin transporter
(Homo sapiens (Human))
BDBM50182763
(CHEMBL3818901)
Show SMILES Cl.COC(=O)c1cccn(C[C@@H]2CNCCO[C@H]2c2ccc(Cl)c(F)c2)c1=O |r|
Show InChI InChI=1S/C19H20ClFN2O4.ClH/c1-26-19(25)14-3-2-7-23(18(14)24)11-13-10-22-6-8-27-17(13)12-4-5-15(20)16(21)9-12;/h2-5,7,9,13,17,22H,6,8,10-11H2,1H3;1H/t13-,17-;/m0./s1
n/an/a 54n/an/an/an/an/an/a
Takeda Pharmaceutical Company Ltd
Curated by ChEMBL
Assay Description
Inhibition of human SERT expressed in CHO cells assessed as [3H]-5-hydroxytryptamine reuptake incubated for 20 mins measured after 30 mins by topcoun...
Bioorg Med Chem 24: 3716-26 (2016)
BindingDB Entry DOI: 10.7270/Q2NP26B4