null
SMILES: CON(C)C(=O)c1ccc(cc1)C(O)(C(F)(F)F)C(F)(F)F
InChI Key: InChIKey=AVNSTFPRTZPEME-UHFFFAOYSA-N
Activity Spreadsheet -- Enzyme Inhibition Constant Data from BindingDB
Found 1 hit for monomerid = 50183298
Trg + Lig
Ki
nM
ΔG°
kcal/mole
IC50
nM
Kd
nM
EC50/IC50
nM
koff
s-1
kon
M-1s-1
pHTemp
°C
Malonyl-CoA decarboxylase, mitochondrial
(Homo sapiens (Human))
BDBM50183298
(CHEMBL202689 | N-methoxy-N-methyl-4-(2,2,2-trifluo...)
Show SMILES CON(C)C(=O)c1ccc(cc1)C(O)(C(F)(F)F)C(F)(F)F
Show InChI InChI=1S/C12H11F6NO3/c1-19(22-2)9(20)7-3-5-8(6-4-7)10(21,11(13,14)15)12(16,17)18/h3-6,21H,1-2H3
Reactome pathway
n/an/a 1.45n/an/an/an/an/an/a
Chugai Pharma USA, LLC.
Curated by ChEMBL
Assay Description
Inhibition of MCD
J Med Chem 49: 1517-25 (2006)
Article DOI: 10.1021/jm050109n
BindingDB Entry DOI: 10.7270/Q2C828XZ