BDBM50183377 CHEMBL383231::methyl 3-[(3-{[2-(methoxycarbonyl)thien-3-yl]amino}-3-oxopropanoyl)amino]thiophene-2-carboxylate
SMILES: COC(=O)c1sccc1NC(=O)CC(=O)Nc1ccsc1C(=O)OC
InChI Key: InChIKey=WZNVWZUBSGPUSQ-UHFFFAOYSA-N
Data: 2 IC50
Activity Spreadsheet -- Enzyme Inhibition Constant Data from BindingDB
Found 2 hits for monomerid = 50183377
Trg + Lig
Ki
nM
ΔG°
kcal/mole
IC50
nM
Kd
nM
EC50/IC50
nM
koff
s-1
kon
M-1s-1
pHTemp
°C
Cysteine protease falcipain-3
(Plasmodium falciparum)
BDBM50183377
(CHEMBL383231 | methyl 3-[(3-{[2-(methoxycarbonyl)t...)
Show SMILES COC(=O)c1sccc1NC(=O)CC(=O)Nc1ccsc1C(=O)OC
Show InChI InChI=1S/C15H14N2O6S2/c1-22-14(20)12-8(3-5-24-12)16-10(18)7-11(19)17-9-4-6-25-13(9)15(21)23-2/h3-6H,7H2,1-2H3,(H,16,18)(H,17,19)
n/an/a>5.00E+4n/an/an/an/an/an/a
University of Mississippi
Curated by ChEMBL
Assay Description
Inhibition of falcipain3
J Med Chem 49: 1576-84 (2006)
Article DOI: 10.1021/jm0505765
BindingDB Entry DOI: 10.7270/Q2B27W35
Falcipain-2
(Plasmodium falciparum)
BDBM50183377
(CHEMBL383231 | methyl 3-[(3-{[2-(methoxycarbonyl)t...)
Show SMILES COC(=O)c1sccc1NC(=O)CC(=O)Nc1ccsc1C(=O)OC
Show InChI InChI=1S/C15H14N2O6S2/c1-22-14(20)12-8(3-5-24-12)16-10(18)7-11(19)17-9-4-6-25-13(9)15(21)23-2/h3-6H,7H2,1-2H3,(H,16,18)(H,17,19)
n/an/a 1.04E+4n/an/an/an/an/an/a
University of Mississippi
Curated by ChEMBL
Assay Description
Inhibition of falcipain2
J Med Chem 49: 1576-84 (2006)
Article DOI: 10.1021/jm0505765
BindingDB Entry DOI: 10.7270/Q2B27W35