null
SMILES: Fc1ccc(Nc2ncnc3cc(OCCCN4CCOCC4)c(NC(=O)[C@@H]4COC(=O)N4)cc23)cc1Cl
InChI Key: InChIKey=BFRZHSWXTMOYRY-NRFANRHFSA-N
Activity Spreadsheet -- Enzyme Inhibition Constant Data from BindingDB
Found 3 hits for monomerid = 50183395
Trg + Lig
Ki
nM
ΔG°
kcal/mole
IC50
nM
Kd
nM
EC50/IC50
nM
koff
s-1
kon
M-1s-1
pHTemp
°C
Epidermal growth factor receptor
(Homo sapiens (Human))
BDBM50183395
(CHEMBL3818289)
Show SMILES Fc1ccc(Nc2ncnc3cc(OCCCN4CCOCC4)c(NC(=O)[C@@H]4COC(=O)N4)cc23)cc1Cl |r|
Show InChI InChI=1S/C25H26ClFN6O5/c26-17-10-15(2-3-18(17)27)30-23-16-11-20(31-24(34)21-13-38-25(35)32-21)22(12-19(16)28-14-29-23)37-7-1-4-33-5-8-36-9-6-33/h2-3,10-12,14,21H,1,4-9,13H2,(H,31,34)(H,32,35)(H,28,29,30)/t21-/m0/s1
n/an/a 4.5n/an/an/an/an/an/a
Zhejiang University
Curated by ChEMBL
Assay Description
Inhibition of wild type human EGFR preincubated for 5 mins followed by ATP addition for 30 mins by HTRF assay
Bioorg Med Chem 24: 3359-70 (2016)
BindingDB Entry DOI: 10.7270/Q2H133ZJ
Epidermal growth factor receptor/Receptor tyrosine-protein kinase erbB-2/Receptor tyrosine-protein kinase erbB-3/Receptor tyrosine-protein kinase erbB-4
(Homo sapiens (Human))
BDBM50183395
(CHEMBL3818289)
Show SMILES Fc1ccc(Nc2ncnc3cc(OCCCN4CCOCC4)c(NC(=O)[C@@H]4COC(=O)N4)cc23)cc1Cl |r|
Show InChI InChI=1S/C25H26ClFN6O5/c26-17-10-15(2-3-18(17)27)30-23-16-11-20(31-24(34)21-13-38-25(35)32-21)22(12-19(16)28-14-29-23)37-7-1-4-33-5-8-36-9-6-33/h2-3,10-12,14,21H,1,4-9,13H2,(H,31,34)(H,32,35)(H,28,29,30)/t21-/m0/s1
n/an/a 59n/an/an/an/an/an/a
Zhejiang University
Curated by ChEMBL
Assay Description
Inhibition of EGFR T790M mutant (unknown origin) preincubated for 5 mins followed by ATP addition for 30 mins by HTRF assay
Bioorg Med Chem 24: 3359-70 (2016)
BindingDB Entry DOI: 10.7270/Q2H133ZJ
Epidermal growth factor receptor/Receptor tyrosine-protein kinase erbB-2/Receptor tyrosine-protein kinase erbB-3/Receptor tyrosine-protein kinase erbB-4
(Homo sapiens (Human))
BDBM50183395
(CHEMBL3818289)
Show SMILES Fc1ccc(Nc2ncnc3cc(OCCCN4CCOCC4)c(NC(=O)[C@@H]4COC(=O)N4)cc23)cc1Cl |r|
Show InChI InChI=1S/C25H26ClFN6O5/c26-17-10-15(2-3-18(17)27)30-23-16-11-20(31-24(34)21-13-38-25(35)32-21)22(12-19(16)28-14-29-23)37-7-1-4-33-5-8-36-9-6-33/h2-3,10-12,14,21H,1,4-9,13H2,(H,31,34)(H,32,35)(H,28,29,30)/t21-/m0/s1
n/an/a 0.830n/an/an/an/an/an/a
Zhejiang University
Curated by ChEMBL
Assay Description
Inhibition of recombinant human EGFR L858R mutant expressed in baculovirus infected insect cells preincubated for 5 mins followed by ATP addition for...
Bioorg Med Chem 24: 3359-70 (2016)
BindingDB Entry DOI: 10.7270/Q2H133ZJ