BDBM50183404 CHEMBL204035::N'-((2-chloro-6-fluorobenzyloxyamino)methylene)-2-(5-phenyl-2H-tetrazol-2-yl)acetohydrazide
SMILES: Fc1cccc(Cl)c1CON=CNNC(=O)Cn1nnc(n1)-c1ccccc1
InChI Key: InChIKey=KOXRXLHBQOFMGP-UHFFFAOYSA-N
Data: 2 IC50
Activity Spreadsheet -- Enzyme Inhibition Constant Data from BindingDB
Found 2 hits for monomerid = 50183404
Trg + Lig
Ki
nM
ΔG°
kcal/mole
IC50
nM
Kd
nM
EC50/IC50
nM
koff
s-1
kon
M-1s-1
pHTemp
°C
Falcipain-2
(Plasmodium falciparum)
BDBM50183404
(CHEMBL204035 | N'-((2-chloro-6-fluorobenzyloxyamin...)
Show SMILES Fc1cccc(Cl)c1CON=CNNC(=O)Cn1nnc(n1)-c1ccccc1 |w:11.12|
Show InChI InChI=1S/C17H15ClFN7O2/c18-14-7-4-8-15(19)13(14)10-28-21-11-20-22-16(27)9-26-24-17(23-25-26)12-5-2-1-3-6-12/h1-8,11H,9-10H2,(H,20,21)(H,22,27)
n/an/a 1.08E+4n/an/an/an/an/an/a
University of Mississippi
Curated by ChEMBL
Assay Description
Inhibition of falcipain2
J Med Chem 49: 1576-84 (2006)
Article DOI: 10.1021/jm0505765
BindingDB Entry DOI: 10.7270/Q2B27W35
Cysteine protease falcipain-3
(Plasmodium falciparum)
BDBM50183404
(CHEMBL204035 | N'-((2-chloro-6-fluorobenzyloxyamin...)
Show SMILES Fc1cccc(Cl)c1CON=CNNC(=O)Cn1nnc(n1)-c1ccccc1 |w:11.12|
Show InChI InChI=1S/C17H15ClFN7O2/c18-14-7-4-8-15(19)13(14)10-28-21-11-20-22-16(27)9-26-24-17(23-25-26)12-5-2-1-3-6-12/h1-8,11H,9-10H2,(H,20,21)(H,22,27)
n/an/a 3.85E+4n/an/an/an/an/an/a
University of Mississippi
Curated by ChEMBL
Assay Description
Inhibition of falcipain3
J Med Chem 49: 1576-84 (2006)
Article DOI: 10.1021/jm0505765
BindingDB Entry DOI: 10.7270/Q2B27W35