BDBM50183573 CHEMBL3822843
SMILES: CN(C)Cc1ccc(cc1)-c1cc(C)c(=O)n(C)c1
InChI Key: InChIKey=WHIFTJHVMMCZLX-UHFFFAOYSA-N
Data: 2 IC50
Activity Spreadsheet -- Enzyme Inhibition Constant Data from BindingDB
Found 2 hits for monomerid = 50183573
Trg + Lig
Ki
nM
ΔG°
kcal/mole
IC50
nM
Kd
nM
EC50/IC50
nM
koff
s-1
kon
M-1s-1
pHTemp
°C
Bromodomain-containing protein 9
(Homo sapiens (Human))
BDBM50183573
(CHEMBL3822843)
Show SMILES CN(C)Cc1ccc(cc1)-c1cc(C)c(=O)n(C)c1
Show InChI InChI=1S/C16H20N2O/c1-12-9-15(11-18(4)16(12)19)14-7-5-13(6-8-14)10-17(2)3/h5-9,11H,10H2,1-4H3
n/an/a 1.15E+3n/an/an/an/an/an/a
Boehringer Ingelheim RCV GmbH& Co KG
Curated by ChEMBL
Assay Description
Inhibition of human N-terminal GST-tagged BRD9 isoform 1 expressed in Escherichia coli using tetra-acetylated histone H4 measured after 60 mins by Al...
J Med Chem 59: 4462-75 (2016)
BindingDB Entry DOI: 10.7270/Q27H1MJZ
Bromodomain-containing protein 4
(Homo sapiens (Human))
BDBM50183573
(CHEMBL3822843)
Show SMILES CN(C)Cc1ccc(cc1)-c1cc(C)c(=O)n(C)c1
Show InChI InChI=1S/C16H20N2O/c1-12-9-15(11-18(4)16(12)19)14-7-5-13(6-8-14)10-17(2)3/h5-9,11H,10H2,1-4H3
n/an/a 3.14E+4n/an/an/an/an/an/a
Boehringer Ingelheim RCV GmbH& Co KG
Curated by ChEMBL
Assay Description
Inhibition of human N-terminal GST-tagged BRD4-BD1 expressed in Escherichia coli using tetra-acetylated histone H4 measured after 60 mins by AlphaScr...
J Med Chem 59: 4462-75 (2016)
BindingDB Entry DOI: 10.7270/Q27H1MJZ