BDBM50183587 CHEMBL379911::c[RGDf-(S,R)-alpha-Dfm-F]
SMILES: [#7]\[#6](-[#7])=[#7]\[#6]-[#6]-[#6]-[#6@@H]-1-[#7]-[#6](=O)C([#6]-c2ccccc2)([#7]-[#6](=O)-[#6@@H](-[#6]-c2ccccc2)-[#7]-[#6](=O)-[#6@H](-[#6]-[#6](-[#8])=O)-[#7]-[#6](=O)-[#6]-[#7]-[#6]-1=O)[#6](F)F
InChI Key: InChIKey=DZUCEYPUEFNCRE-ZONASRJLSA-N
Data: 2 IC50
Activity Spreadsheet -- Enzyme Inhibition Constant Data from BindingDB
Found 2 hits for monomerid = 50183587
Trg + Lig
Ki
nM
ΔG°
kcal/mole
IC50
nM
Kd
nM
EC50/IC50
nM
koff
s-1
kon
M-1s-1
pHTemp
°C
ITGAV/ITGB5
(Homo sapiens (Human))
BDBM50183587
(CHEMBL379911 | c[RGDf-(S,R)-alpha-Dfm-F])
Show SMILES [#7]\[#6](-[#7])=[#7]\[#6]-[#6]-[#6]-[#6@@H]-1-[#7]-[#6](=O)C([#6]-c2ccccc2)([#7]-[#6](=O)-[#6@@H](-[#6]-c2ccccc2)-[#7]-[#6](=O)-[#6@H](-[#6]-[#6](-[#8])=O)-[#7]-[#6](=O)-[#6]-[#7]-[#6]-1=O)[#6](F)F
Show InChI InChI=1S/C31H38F2N8O7/c32-28(33)31(16-19-10-5-2-6-11-19)29(48)40-20(12-7-13-36-30(34)35)25(45)37-17-23(42)38-22(15-24(43)44)26(46)39-21(27(47)41-31)14-18-8-3-1-4-9-18/h1-6,8-11,20-22,28H,7,12-17H2,(H,37,45)(H,38,42)(H,39,46)(H,40,48)(H,41,47)(H,43,44)(H4,34,35,36)/t20-,21+,22-,31?/m0/s1
NCI pathway
Reactome pathway
n/an/a 5.5n/an/an/an/an/an/a
Istituto di Ricerche Chimiche e Biochimiche G. Ronzoni
Curated by ChEMBL
Assay Description
Displacement of [125I]echistatin from AlphaVbeta5 integrin receptor
J Med Chem 49: 1808-17 (2006)
Article DOI: 10.1021/jm0511334
BindingDB Entry DOI: 10.7270/Q2G160FD
ITGAV/ITGB3
(Homo sapiens (Human))
BDBM50183587
(CHEMBL379911 | c[RGDf-(S,R)-alpha-Dfm-F])
Show SMILES [#7]\[#6](-[#7])=[#7]\[#6]-[#6]-[#6]-[#6@@H]-1-[#7]-[#6](=O)C([#6]-c2ccccc2)([#7]-[#6](=O)-[#6@@H](-[#6]-c2ccccc2)-[#7]-[#6](=O)-[#6@H](-[#6]-[#6](-[#8])=O)-[#7]-[#6](=O)-[#6]-[#7]-[#6]-1=O)[#6](F)F
Show InChI InChI=1S/C31H38F2N8O7/c32-28(33)31(16-19-10-5-2-6-11-19)29(48)40-20(12-7-13-36-30(34)35)25(45)37-17-23(42)38-22(15-24(43)44)26(46)39-21(27(47)41-31)14-18-8-3-1-4-9-18/h1-6,8-11,20-22,28H,7,12-17H2,(H,37,45)(H,38,42)(H,39,46)(H,40,48)(H,41,47)(H,43,44)(H4,34,35,36)/t20-,21+,22-,31?/m0/s1
n/an/a 332n/an/an/an/an/an/a
Istituto di Ricerche Chimiche e Biochimiche G. Ronzoni
Curated by ChEMBL
Assay Description
Displacement of [125I]echistatin from AlphaVbeta3 integrin receptor
J Med Chem 49: 1808-17 (2006)
Article DOI: 10.1021/jm0511334
BindingDB Entry DOI: 10.7270/Q2G160FD