null
SMILES: COc1cc(Nc2ncc3ccn(-c4cccc(c4)C(=O)NCCNC(C)=O)c3n2)cc(OC)c1OC
InChI Key: InChIKey=XHUHVFCLDIPMCH-UHFFFAOYSA-N
Activity Spreadsheet -- Enzyme Inhibition Constant Data from BindingDB
Found 1 hit for monomerid = 50183981
Trg + Lig
Ki
nM
ΔG°
kcal/mole
IC50
nM
Kd
nM
EC50/IC50
nM
koff
s-1
kon
M-1s-1
pHTemp
°C
Focal adhesion kinase 1
(Homo sapiens (Human))
BDBM50183981
(CHEMBL207444 | N-(2-acetamidoethyl)-3-(2-(3,4,5-tr...)
Show SMILES COc1cc(Nc2ncc3ccn(-c4cccc(c4)C(=O)NCCNC(C)=O)c3n2)cc(OC)c1OC
Show InChI InChI=1S/C26H28N6O5/c1-16(33)27-9-10-28-25(34)17-6-5-7-20(12-17)32-11-8-18-15-29-26(31-24(18)32)30-19-13-21(35-2)23(37-4)22(14-19)36-3/h5-8,11-15H,9-10H2,1-4H3,(H,27,33)(H,28,34)(H,29,30,31)
NCI pathway
Reactome pathway
n/an/a 298n/an/an/an/an/an/a
Genomics Institute of the Novartis Research Foundation (GNF)
Curated by ChEMBL
Assay Description
Inhibition of FAK
Bioorg Med Chem Lett 16: 2689-92 (2006)
Article DOI: 10.1016/j.bmcl.2006.02.032
BindingDB Entry DOI: 10.7270/Q2NK3DN0