null
SMILES: CCCNS(=O)(=O)c1ccccc1-n1ccc2cnc(Nc3cc(OC)c(OC)c(OC)c3)nc12
InChI Key: InChIKey=KMUFOVGPZGUDEB-UHFFFAOYSA-N
Activity Spreadsheet -- Enzyme Inhibition Constant Data from BindingDB
Found 1 hit for monomerid = 50183993
Trg + Lig
Ki
nM
ΔG°
kcal/mole
IC50
nM
Kd
nM
EC50/IC50
nM
koff
s-1
kon
M-1s-1
pHTemp
°C
Focal adhesion kinase 1
(Homo sapiens (Human))
BDBM50183993
(CHEMBL208322 | N-propyl-2-(2-(3,4,5-trimethoxyphen...)
Show SMILES CCCNS(=O)(=O)c1ccccc1-n1ccc2cnc(Nc3cc(OC)c(OC)c(OC)c3)nc12
Show InChI InChI=1S/C24H27N5O5S/c1-5-11-26-35(30,31)21-9-7-6-8-18(21)29-12-10-16-15-25-24(28-23(16)29)27-17-13-19(32-2)22(34-4)20(14-17)33-3/h6-10,12-15,26H,5,11H2,1-4H3,(H,25,27,28)
NCI pathway
Reactome pathway
n/an/a 3.50E+3n/an/an/an/an/an/a
Genomics Institute of the Novartis Research Foundation (GNF)
Curated by ChEMBL
Assay Description
Inhibition of FAK
Bioorg Med Chem Lett 16: 2689-92 (2006)
Article DOI: 10.1016/j.bmcl.2006.02.032
BindingDB Entry DOI: 10.7270/Q2NK3DN0