BDBM50184004 7-(2-aminophenyl)-N-(3,4,5-trimethoxyphenyl)-7H-pyrrolo[2,3-d]pyrimidin-2-amine::CHEMBL379269
SMILES: COc1cc(Nc2ncc3ccn(-c4ccccc4N)c3n2)cc(OC)c1OC
InChI Key: InChIKey=KTLSJLHLGUUGKC-UHFFFAOYSA-N
Data: 1 IC50
Activity Spreadsheet -- Enzyme Inhibition Constant Data from BindingDB
Found 1 hit for monomerid = 50184004
Trg + Lig
Ki
nM
ΔG°
kcal/mole
IC50
nM
Kd
nM
EC50/IC50
nM
koff
s-1
kon
M-1s-1
pHTemp
°C
Focal adhesion kinase 1
(Homo sapiens (Human))
BDBM50184004
(7-(2-aminophenyl)-N-(3,4,5-trimethoxyphenyl)-7H-py...)
Show SMILES COc1cc(Nc2ncc3ccn(-c4ccccc4N)c3n2)cc(OC)c1OC
Show InChI InChI=1S/C21H21N5O3/c1-27-17-10-14(11-18(28-2)19(17)29-3)24-21-23-12-13-8-9-26(20(13)25-21)16-7-5-4-6-15(16)22/h4-12H,22H2,1-3H3,(H,23,24,25)
NCI pathway
Reactome pathway
n/an/a>1.00E+4n/an/an/an/an/an/a
Genomics Institute of the Novartis Research Foundation (GNF)
Curated by ChEMBL
Assay Description
Inhibition of FAK
Bioorg Med Chem Lett 16: 2689-92 (2006)
Article DOI: 10.1016/j.bmcl.2006.02.032
BindingDB Entry DOI: 10.7270/Q2NK3DN0