null
SMILES: COc1cc(Nc2ncc3ccn(-c4cccc(CCC#N)c4)c3n2)cc(OC)c1OC
InChI Key: InChIKey=KKVZKYOBQGDKIB-UHFFFAOYSA-N
PDB links: 1 PDB ID matches this monomer.
Activity Spreadsheet -- Enzyme Inhibition Constant Data from BindingDB
Found 1 hit for monomerid = 50184020
Trg + Lig
Ki
nM
ΔG°
kcal/mole
IC50
nM
Kd
nM
EC50/IC50
nM
koff
s-1
kon
M-1s-1
pHTemp
°C
Focal adhesion kinase 1
(Homo sapiens (Human))
BDBM50184020
(3-(3-(2-(3,4,5-trimethoxyphenylamino)-7H-pyrrolo[2...)
Show SMILES COc1cc(Nc2ncc3ccn(-c4cccc(CCC#N)c4)c3n2)cc(OC)c1OC
Show InChI InChI=1S/C24H23N5O3/c1-30-20-13-18(14-21(31-2)22(20)32-3)27-24-26-15-17-9-11-29(23(17)28-24)19-8-4-6-16(12-19)7-5-10-25/h4,6,8-9,11-15H,5,7H2,1-3H3,(H,26,27,28)
NCI pathway
Reactome pathway
n/an/a 93n/an/an/an/an/an/a
Genomics Institute of the Novartis Research Foundation (GNF)
Curated by ChEMBL
Assay Description
Inhibition of FAK
Bioorg Med Chem Lett 16: 2689-92 (2006)
Article DOI: 10.1016/j.bmcl.2006.02.032
BindingDB Entry DOI: 10.7270/Q2NK3DN0