null
SMILES: COc1cc(Nc2ncc3ccn(-c4cccc(c4)C(=O)NC4CC4)c3n2)cc(OC)c1OC
InChI Key: InChIKey=LOKFDMXYKLQEMD-UHFFFAOYSA-N
Activity Spreadsheet -- Enzyme Inhibition Constant Data from BindingDB
Found 1 hit for monomerid = 50184025
Trg + Lig
Ki
nM
ΔG°
kcal/mole
IC50
nM
Kd
nM
EC50/IC50
nM
koff
s-1
kon
M-1s-1
pHTemp
°C
Focal adhesion kinase 1
(Homo sapiens (Human))
BDBM50184025
(CHEMBL208468 | N-cyclopropyl-3-(2-(3,4,5-trimethox...)
Show SMILES COc1cc(Nc2ncc3ccn(-c4cccc(c4)C(=O)NC4CC4)c3n2)cc(OC)c1OC
Show InChI InChI=1S/C25H25N5O4/c1-32-20-12-18(13-21(33-2)22(20)34-3)28-25-26-14-16-9-10-30(23(16)29-25)19-6-4-5-15(11-19)24(31)27-17-7-8-17/h4-6,9-14,17H,7-8H2,1-3H3,(H,27,31)(H,26,28,29)
NCI pathway
Reactome pathway
n/an/a 322n/an/an/an/an/an/a
Genomics Institute of the Novartis Research Foundation (GNF)
Curated by ChEMBL
Assay Description
Inhibition of FAK
Bioorg Med Chem Lett 16: 2689-92 (2006)
Article DOI: 10.1016/j.bmcl.2006.02.032
BindingDB Entry DOI: 10.7270/Q2NK3DN0