null
SMILES: COc1cc(Nc2ncc3cc(C(O)=O)n(-c4ccccn4)c3n2)cc(OC)c1OC
InChI Key: InChIKey=DBWAKKKAIPGOJV-UHFFFAOYSA-N
Activity Spreadsheet -- Enzyme Inhibition Constant Data from BindingDB
Found 1 hit for monomerid = 50184045
Trg + Lig
Ki
nM
ΔG°
kcal/mole
IC50
nM
Kd
nM
EC50/IC50
nM
koff
s-1
kon
M-1s-1
pHTemp
°C
Focal adhesion kinase 1
(Homo sapiens (Human))
BDBM50184045
(7-(pyridin-2-yl)-2-(3,4,5-trimethoxyphenylamino)-7...)
Show SMILES COc1cc(Nc2ncc3cc(C(O)=O)n(-c4ccccn4)c3n2)cc(OC)c1OC
Show InChI InChI=1S/C21H19N5O5/c1-29-15-9-13(10-16(30-2)18(15)31-3)24-21-23-11-12-8-14(20(27)28)26(19(12)25-21)17-6-4-5-7-22-17/h4-11H,1-3H3,(H,27,28)(H,23,24,25)
NCI pathway
Reactome pathway
n/an/a>1.00E+4n/an/an/an/an/an/a
Genomics Institute of the Novartis Research Foundation (GNF)
Curated by ChEMBL
Assay Description
Inhibition of FAK
Bioorg Med Chem Lett 16: 2689-92 (2006)
Article DOI: 10.1016/j.bmcl.2006.02.032
BindingDB Entry DOI: 10.7270/Q2NK3DN0