null
SMILES: COc1cc(Nc2ncc3ccn(-c4cccc(Cc5nnn[nH]5)c4)c3n2)cc(OC)c1OC
InChI Key: InChIKey=HLAUEPWVFQFKPR-UHFFFAOYSA-N
Activity Spreadsheet -- Enzyme Inhibition Constant Data from BindingDB
Found 1 hit for monomerid = 50184047
Trg + Lig
Ki
nM
ΔG°
kcal/mole
IC50
nM
Kd
nM
EC50/IC50
nM
koff
s-1
kon
M-1s-1
pHTemp
°C
Focal adhesion kinase 1
(Homo sapiens (Human))
BDBM50184047
(7-(3-((2H-tetrazol-5-yl)methyl)phenyl)-N-(3,4,5-tr...)
Show SMILES COc1cc(Nc2ncc3ccn(-c4cccc(Cc5nnn[nH]5)c4)c3n2)cc(OC)c1OC
Show InChI InChI=1S/C23H22N8O3/c1-32-18-11-16(12-19(33-2)21(18)34-3)25-23-24-13-15-7-8-31(22(15)26-23)17-6-4-5-14(9-17)10-20-27-29-30-28-20/h4-9,11-13H,10H2,1-3H3,(H,24,25,26)(H,27,28,29,30)
NCI pathway
Reactome pathway
n/an/a 232n/an/an/an/an/an/a
Genomics Institute of the Novartis Research Foundation (GNF)
Curated by ChEMBL
Assay Description
Inhibition of FAK
Bioorg Med Chem Lett 16: 2689-92 (2006)
Article DOI: 10.1016/j.bmcl.2006.02.032
BindingDB Entry DOI: 10.7270/Q2NK3DN0