null
SMILES: COc1cc(Nc2ncc3ccn(-c4ccccc4C)c3n2)cc(OC)c1OC
InChI Key: InChIKey=ZDSDZKQNHFVUQQ-UHFFFAOYSA-N
Activity Spreadsheet -- Enzyme Inhibition Constant Data from BindingDB
Found 1 hit for monomerid = 50184048
Trg + Lig
Ki
nM
ΔG°
kcal/mole
IC50
nM
Kd
nM
EC50/IC50
nM
koff
s-1
kon
M-1s-1
pHTemp
°C
Focal adhesion kinase 1
(Homo sapiens (Human))
BDBM50184048
(7-o-tolyl-N-(3,4,5-trimethoxyphenyl)-7H-pyrrolo[2,...)
Show SMILES COc1cc(Nc2ncc3ccn(-c4ccccc4C)c3n2)cc(OC)c1OC
Show InChI InChI=1S/C22H22N4O3/c1-14-7-5-6-8-17(14)26-10-9-15-13-23-22(25-21(15)26)24-16-11-18(27-2)20(29-4)19(12-16)28-3/h5-13H,1-4H3,(H,23,24,25)
NCI pathway
Reactome pathway
n/an/a 2.81E+3n/an/an/an/an/an/a
Genomics Institute of the Novartis Research Foundation (GNF)
Curated by ChEMBL
Assay Description
Inhibition of FAK
Bioorg Med Chem Lett 16: 2689-92 (2006)
Article DOI: 10.1016/j.bmcl.2006.02.032
BindingDB Entry DOI: 10.7270/Q2NK3DN0