null
SMILES: COC(=O)C1=C([C@@H]2c3ccccc3S[C@]12C(=O)OC)N1CCCC1
InChI Key: InChIKey=WEPFRJIQIIGTEM-UGSOOPFHSA-N
Activity Spreadsheet -- Enzyme Inhibition Constant Data from BindingDB
Found 1 hit for monomerid = 50184090
Trg + Lig
Ki
nM
ΔG°
kcal/mole
IC50
nM
Kd
nM
EC50/IC50
nM
koff
s-1
kon
M-1s-1
pHTemp
°C
Reverse transcriptase/RNaseH
(Human immunodeficiency virus 1)
BDBM50184090
((S,S)-dimethyl-1-(1-piperidynyl)cyclobuta[b][1]ben...)
Show SMILES COC(=O)C1=C([C@@H]2c3ccccc3S[C@]12C(=O)OC)N1CCCC1 |t:4|
Show InChI InChI=1S/C18H19NO4S/c1-22-16(20)14-15(19-9-5-6-10-19)13-11-7-3-4-8-12(11)24-18(13,14)17(21)23-2/h3-4,7-8,13H,5-6,9-10H2,1-2H3/t13-,18-/m0/s1
n/an/a>2.00E+4n/an/an/an/an/an/a
NIH
Curated by ChEMBL
Assay Description
Inhibition of wild type HIV1 reverse transcriptase in 293T cells
Bioorg Med Chem Lett 16: 3034-8 (2006)
Article DOI: 10.1016/j.bmcl.2006.02.049
BindingDB Entry DOI: 10.7270/Q2DN45VP