BDBM50184165 4'-trifluoromethyl-biphenyl-2-carboxylic acid (4-{[(S)-(cyclopropylmethyl-carbamoyl)-phenyl-methyl]-carbamoyl}-2-ethyl-phenyl)-amide::CHEMBL378844
SMILES: Cc1cc(ccc1NC(=O)c1ccccc1-c1ccc(cc1)C(F)(F)F)C(=O)N[C@H](C(=O)NCC1CC1)c1ccccc1
InChI Key: InChIKey=BCOIEGHEYXXXAJ-PMERELPUSA-N
Data: 1 IC50
Activity Spreadsheet -- Enzyme Inhibition Constant Data from BindingDB
Found 1 hit for monomerid = 50184165
Trg + Lig
Ki
nM
ΔG°
kcal/mole
IC50
nM
Kd
nM
EC50/IC50
nM
koff
s-1
kon
M-1s-1
pHTemp
°C
Microsomal triglyceride transfer protein
(Homo sapiens (Human))
BDBM50184165
(4'-trifluoromethyl-biphenyl-2-carboxylic acid (4-{...)
Show SMILES Cc1cc(ccc1NC(=O)c1ccccc1-c1ccc(cc1)C(F)(F)F)C(=O)N[C@H](C(=O)NCC1CC1)c1ccccc1
Show InChI InChI=1S/C34H30F3N3O3/c1-21-19-25(31(41)40-30(24-7-3-2-4-8-24)33(43)38-20-22-11-12-22)15-18-29(21)39-32(42)28-10-6-5-9-27(28)23-13-16-26(17-14-23)34(35,36)37/h2-10,13-19,22,30H,11-12,20H2,1H3,(H,38,43)(H,39,42)(H,40,41)/t30-/m0/s1
Reactome pathway
n/an/a 1.78n/an/an/an/an/an/a
Pfizer Inc.
Curated by ChEMBL
Assay Description
Inhibition of MTP in canine liver microsomes
Bioorg Med Chem Lett 16: 3039-42 (2006)
Article DOI: 10.1016/j.bmcl.2006.02.058
BindingDB Entry DOI: 10.7270/Q2D21X68