BDBM50184760 (2S,3S,4S)-methyl 1-benzyl-2-ethyl-4-hydroxy-5-(2-oxotetradecylidene)pyrrolidine-3-carboxylate::CHEMBL208804
SMILES: CCCCCCCCCCCCC(=O)C=C1[C@@H](O)[C@H]([C@H](CC)N1Cc1ccccc1)C(=O)OC
InChI Key: InChIKey=QHOWTIFZDFDLPJ-RZDMPUFOSA-N
Data: 3 IC50
Activity Spreadsheet -- Enzyme Inhibition Constant Data from BindingDB
Found 3 hits for monomerid = 50184760
Trg + Lig
Ki
nM
ΔG°
kcal/mole
IC50
nM
Kd
nM
EC50/IC50
nM
koff
s-1
kon
M-1s-1
pHTemp
°C
DNA polymerase (alpha/delta/epsilon)
(Homo sapiens (Human))
BDBM50184760
((2S,3S,4S)-methyl 1-benzyl-2-ethyl-4-hydroxy-5-(2-...)
Show SMILES CCCCCCCCCCCCC(=O)C=C1[C@@H](O)[C@H]([C@H](CC)N1Cc1ccccc1)C(=O)OC |w:14.13|
Show InChI InChI=1S/C29H45NO4/c1-4-6-7-8-9-10-11-12-13-17-20-24(31)21-26-28(32)27(29(33)34-3)25(5-2)30(26)22-23-18-15-14-16-19-23/h14-16,18-19,21,25,27-28,32H,4-13,17,20,22H2,1-3H3/t25-,27-,28+/m0/s1
NCI pathway
Reactome pathway
n/an/a 1.97E+4n/an/an/an/an/an/a
The University of Manchester
Curated by ChEMBL
Assay Description
Inhibition of DNA polymerase alpha
Bioorg Med Chem Lett 16: 2877-81 (2006)
Article DOI: 10.1016/j.bmcl.2006.03.005
BindingDB Entry DOI: 10.7270/Q25D8RF8
Terminal deoxynucleotidyltransferase
(Homo sapiens (Human))
BDBM50184760
((2S,3S,4S)-methyl 1-benzyl-2-ethyl-4-hydroxy-5-(2-...)
Show SMILES CCCCCCCCCCCCC(=O)C=C1[C@@H](O)[C@H]([C@H](CC)N1Cc1ccccc1)C(=O)OC |w:14.13|
Show InChI InChI=1S/C29H45NO4/c1-4-6-7-8-9-10-11-12-13-17-20-24(31)21-26-28(32)27(29(33)34-3)25(5-2)30(26)22-23-18-15-14-16-19-23/h14-16,18-19,21,25,27-28,32H,4-13,17,20,22H2,1-3H3/t25-,27-,28+/m0/s1
NCI pathway
n/an/a>5.00E+4n/an/an/an/an/an/a
The University of Manchester
Curated by ChEMBL
Assay Description
Inhibition of human TdT
Bioorg Med Chem Lett 16: 2877-81 (2006)
Article DOI: 10.1016/j.bmcl.2006.03.005
BindingDB Entry DOI: 10.7270/Q25D8RF8
DNA polymerase beta
(Homo sapiens (Human))
BDBM50184760
((2S,3S,4S)-methyl 1-benzyl-2-ethyl-4-hydroxy-5-(2-...)
Show SMILES CCCCCCCCCCCCC(=O)C=C1[C@@H](O)[C@H]([C@H](CC)N1Cc1ccccc1)C(=O)OC |w:14.13|
Show InChI InChI=1S/C29H45NO4/c1-4-6-7-8-9-10-11-12-13-17-20-24(31)21-26-28(32)27(29(33)34-3)25(5-2)30(26)22-23-18-15-14-16-19-23/h14-16,18-19,21,25,27-28,32H,4-13,17,20,22H2,1-3H3/t25-,27-,28+/m0/s1
Reactome pathway
n/an/a 2.71E+4n/an/an/an/an/an/a
The University of Manchester
Curated by ChEMBL
Assay Description
Inhibition of DNA polymerase beta
Bioorg Med Chem Lett 16: 2877-81 (2006)
Article DOI: 10.1016/j.bmcl.2006.03.005
BindingDB Entry DOI: 10.7270/Q25D8RF8