BDBM50184808 (S)-1-(4-(4-fluoro-2-methyl-1H-indol-5-yloxy)-5-methylpyrrolo[2,1-f][1,2,4]triazin-6-yloxy)propan-2-ol::CHEMBL427202
SMILES: C[C@H](O)COc1cn2ncnc(Oc3ccc4[nH]c(C)cc4c3F)c2c1C
InChI Key: InChIKey=WCWUXEGQKLTGDX-NSHDSACASA-N
Data: 4 IC50
Activity Spreadsheet -- Enzyme Inhibition Constant Data from BindingDB
Found 4 hits for monomerid = 50184808
Trg + Lig
Ki
nM
ΔG°
kcal/mole
IC50
nM
Kd
nM
EC50/IC50
nM
koff
s-1
kon
M-1s-1
pHTemp
°C
Vascular endothelial growth factor receptor 2
(Homo sapiens (Human))
BDBM50184808
((S)-1-(4-(4-fluoro-2-methyl-1H-indol-5-yloxy)-5-me...)
Show SMILES C[C@H](O)COc1cn2ncnc(Oc3ccc4[nH]c(C)cc4c3F)c2c1C
Show InChI InChI=1S/C19H19FN4O3/c1-10-6-13-14(23-10)4-5-15(17(13)20)27-19-18-12(3)16(26-8-11(2)25)7-24(18)22-9-21-19/h4-7,9,11,23,25H,8H2,1-3H3/t11-/m0/s1
NCI pathway
Reactome pathway
n/an/a 40n/an/an/an/an/an/a
Pharmaceutical Research Institute
Curated by ChEMBL
Assay Description
Inhibitory activity against VEGFR2
J Med Chem 49: 2143-6 (2006)
Article DOI: 10.1021/jm051106d
BindingDB Entry DOI: 10.7270/Q2WW7H7N
Fibroblast growth factor receptor 1
(Homo sapiens (Human))
BDBM50184808
((S)-1-(4-(4-fluoro-2-methyl-1H-indol-5-yloxy)-5-me...)
Show SMILES C[C@H](O)COc1cn2ncnc(Oc3ccc4[nH]c(C)cc4c3F)c2c1C
Show InChI InChI=1S/C19H19FN4O3/c1-10-6-13-14(23-10)4-5-15(17(13)20)27-19-18-12(3)16(26-8-11(2)25)7-24(18)22-9-21-19/h4-7,9,11,23,25H,8H2,1-3H3/t11-/m0/s1
NCI pathway
Reactome pathway
n/an/a 22n/an/an/an/an/an/a
Bristol-Myers Squibb
Curated by ChEMBL
Assay Description
Inhibition of recombinant FGFR-1 (unknown origin)
Drug Metab Dispos 40: 2374-80 (2012)
Article DOI: 10.1124/dmd.112.047340
BindingDB Entry DOI: 10.7270/Q2X3506M
Vascular endothelial growth factor receptor 2
(Homo sapiens (Human))
BDBM50184808
((S)-1-(4-(4-fluoro-2-methyl-1H-indol-5-yloxy)-5-me...)
Show SMILES C[C@H](O)COc1cn2ncnc(Oc3ccc4[nH]c(C)cc4c3F)c2c1C
Show InChI InChI=1S/C19H19FN4O3/c1-10-6-13-14(23-10)4-5-15(17(13)20)27-19-18-12(3)16(26-8-11(2)25)7-24(18)22-9-21-19/h4-7,9,11,23,25H,8H2,1-3H3/t11-/m0/s1
NCI pathway
Reactome pathway
n/an/a 20n/an/an/an/an/an/a
Bristol-Myers Squibb
Curated by ChEMBL
Assay Description
Inhibition of recombinant VEGFR-2 (unknown origin)
Drug Metab Dispos 40: 2374-80 (2012)
Article DOI: 10.1124/dmd.112.047340
BindingDB Entry DOI: 10.7270/Q2X3506M
Cytochrome P450 3A4
(Homo sapiens (Human))
BDBM50184808
((S)-1-(4-(4-fluoro-2-methyl-1H-indol-5-yloxy)-5-me...)
Show SMILES C[C@H](O)COc1cn2ncnc(Oc3ccc4[nH]c(C)cc4c3F)c2c1C
Show InChI InChI=1S/C19H19FN4O3/c1-10-6-13-14(23-10)4-5-15(17(13)20)27-19-18-12(3)16(26-8-11(2)25)7-24(18)22-9-21-19/h4-7,9,11,23,25H,8H2,1-3H3/t11-/m0/s1
Reactome pathway
n/an/a 4.00E+3n/an/an/an/an/an/a
Pharmaceutical Research Institute
Curated by ChEMBL
Assay Description
Inhibitory activity against CYP3A4
J Med Chem 49: 2143-6 (2006)
Article DOI: 10.1021/jm051106d
BindingDB Entry DOI: 10.7270/Q2WW7H7N