null
SMILES: Fc1ccc(cc1)-c1cc(ccn1)-c1c[nH]nc1-c1ccccn1
InChI Key: InChIKey=HZJPBOLTWHOKEL-UHFFFAOYSA-N
Activity Spreadsheet -- Enzyme Inhibition Constant Data from BindingDB
Found 2 hits for monomerid = 50184901
Trg + Lig
Ki
nM
ΔG°
kcal/mole
IC50
nM
Kd
nM
EC50/IC50
nM
koff
s-1
kon
M-1s-1
pHTemp
°C
TGF-beta receptor type-1
(Homo sapiens (Human))
BDBM50184901
(2-(4-fluorophenyl)-4-(3-(pyridin-2-yl)-1H-pyrazol-...)
Show SMILES Fc1ccc(cc1)-c1cc(ccn1)-c1c[nH]nc1-c1ccccn1
Show InChI InChI=1S/C19H13FN4/c20-15-6-4-13(5-7-15)18-11-14(8-10-22-18)16-12-23-24-19(16)17-3-1-2-9-21-17/h1-12H,(H,23,24)
n/an/a 48n/an/an/an/an/an/a
GlaxoSmithKline
Curated by ChEMBL
Assay Description
Displacement of rhodamine green fluorescently labeled ATP from recombinant GST-ALK5 by FP assay
J Med Chem 49: 2210-21 (2006)
Article DOI: 10.1021/jm0509905
BindingDB Entry DOI: 10.7270/Q2DV1KPB
TGF-beta receptor type-1
(Homo sapiens (Human))
BDBM50184901
(2-(4-fluorophenyl)-4-(3-(pyridin-2-yl)-1H-pyrazol-...)
Show SMILES Fc1ccc(cc1)-c1cc(ccn1)-c1c[nH]nc1-c1ccccn1
Show InChI InChI=1S/C19H13FN4/c20-15-6-4-13(5-7-15)18-11-14(8-10-22-18)16-12-23-24-19(16)17-3-1-2-9-21-17/h1-12H,(H,23,24)
n/an/a 48n/an/an/an/an/an/a
Sichuan University
Curated by ChEMBL
Assay Description
Inhibition of TGFR1
Eur J Med Chem 44: 4259-65 (2009)
Article DOI: 10.1016/j.ejmech.2009.07.008
BindingDB Entry DOI: 10.7270/Q2BC3ZM9