BDBM50185038 CHEMBL202741::N-(4-phenoxyphenyl)-N'-[2-(2-pyrrolidin-1-ylethyl)-2H-indazol-5-yl]urea
SMILES: O=C(Nc1ccc(Oc2ccccc2)cc1)Nc1ccc2nn(CCN3CCCC3)cc2c1
InChI Key: InChIKey=LUDDAWLMHRIEHA-UHFFFAOYSA-N
Data: 1 IC50
Activity Spreadsheet -- Enzyme Inhibition Constant Data from BindingDB
Found 1 hit for monomerid = 50185038
Trg + Lig
Ki
nM
ΔG°
kcal/mole
IC50
nM
Kd
nM
EC50/IC50
nM
koff
s-1
kon
M-1s-1
pHTemp
°C
Melanin-concentrating hormone receptor
(Homo sapiens (Human))
BDBM50185038
(CHEMBL202741 | N-(4-phenoxyphenyl)-N'-[2-(2-pyrrol...)
Show SMILES O=C(Nc1ccc(Oc2ccccc2)cc1)Nc1ccc2nn(CCN3CCCC3)cc2c1
Show InChI InChI=1S/C26H27N5O2/c32-26(27-21-8-11-24(12-9-21)33-23-6-2-1-3-7-23)28-22-10-13-25-20(18-22)19-31(29-25)17-16-30-14-4-5-15-30/h1-3,6-13,18-19H,4-5,14-17H2,(H2,27,28,32)
Reactome pathway
n/an/a 46n/an/an/an/an/an/a
Abbott Laboratories
Curated by ChEMBL
Assay Description
Displacement of [125I]-MCH from MCHr1 expressed in IMR32 (I3.4.2) cells
J Med Chem 49: 2339-52 (2006)
Article DOI: 10.1021/jm0512286
BindingDB Entry DOI: 10.7270/Q24F1Q9F