BDBM50185120 3alpha,24-dihydroxyolean-12-en-27-oic acid::CHEMBL207657
SMILES: CC1(C)CC[C@]2(C)CC[C@]3(C(O)=O)C(=CC[C@@H]4[C@@]5(C)CC[C@@H](O)[C@](C)(CO)C5CC[C@@]34C)[C@@H]2C1
InChI Key: InChIKey=HQGWITLOHQUPBL-NFHCHMPHSA-N
Data: 1 IC50
Activity Spreadsheet -- Enzyme Inhibition Constant Data from BindingDB
Found 1 hit for monomerid = 50185120
Trg + Lig
Ki
nM
ΔG°
kcal/mole
IC50
nM
Kd
nM
EC50/IC50
nM
koff
s-1
kon
M-1s-1
pHTemp
°C
Protein-tyrosine phosphatase 1B
(Homo sapiens (Human))
BDBM50185120
(3alpha,24-dihydroxyolean-12-en-27-oic acid | CHEMB...)
Show SMILES CC1(C)CC[C@]2(C)CC[C@]3(C(O)=O)C(=CC[C@@H]4[C@@]5(C)CC[C@@H](O)[C@](C)(CO)C5CC[C@@]34C)[C@@H]2C1 |c:13|
Show InChI InChI=1S/C30H48O4/c1-25(2)13-14-26(3)15-16-30(24(33)34)19(20(26)17-25)7-8-22-27(4)11-10-23(32)28(5,18-31)21(27)9-12-29(22,30)6/h7,20-23,31-32H,8-18H2,1-6H3,(H,33,34)/t20-,21?,22+,23+,26+,27-,28+,29+,30+/m0/s1
NCI pathway
Reactome pathway
n/an/a 1.17E+4n/an/an/an/an/an/a
Korea Research Institute of Bioscience and Biotechnology
Curated by ChEMBL
Assay Description
Inhibition of human recombinant PTP1B
Bioorg Med Chem Lett 16: 3273-6 (2006)
Article DOI: 10.1016/j.bmcl.2006.03.036
BindingDB Entry DOI: 10.7270/Q2ZP46WV