BDBM50185160 CHEMBL3824301
SMILES: COc1cc(ccc1Nc1ncc(Cl)c(Nc2ccccc2C(C)=O)n1)N1CCC(CC1)N1CCN(C)CC1
InChI Key: InChIKey=RKXGEBJVNGSICG-UHFFFAOYSA-N
Data: 3 IC50
Activity Spreadsheet -- Enzyme Inhibition Constant Data from BindingDB
Found 3 hits for monomerid = 50185160
Trg + Lig
Ki
nM
ΔG°
kcal/mole
IC50
nM
Kd
nM
EC50/IC50
nM
koff
s-1
kon
M-1s-1
pHTemp
°C
Insulin receptor
(Homo sapiens (Human))
BDBM50185160
(CHEMBL3824301)
Show SMILES COc1cc(ccc1Nc1ncc(Cl)c(Nc2ccccc2C(C)=O)n1)N1CCC(CC1)N1CCN(C)CC1
Show InChI InChI=1S/C29H36ClN7O2/c1-20(38)23-6-4-5-7-25(23)32-28-24(30)19-31-29(34-28)33-26-9-8-22(18-27(26)39-3)36-12-10-21(11-13-36)37-16-14-35(2)15-17-37/h4-9,18-19,21H,10-17H2,1-3H3,(H2,31,32,33,34)
n/an/a 2.20n/an/an/an/an/an/a
ARIAD Pharmaceuticals, Inc.
Curated by ChEMBL
Assay Description
Inhibition of human InsR using myelin basic protein as substrate and [gamma-33P]ATP measured after 1 hr
J Med Chem 59: 4948-64 (2016)
BindingDB Entry DOI: 10.7270/Q2NK3H0Q
ALK tyrosine kinase receptor
(Homo sapiens (Human))
BDBM50185160
(CHEMBL3824301)
Show SMILES COc1cc(ccc1Nc1ncc(Cl)c(Nc2ccccc2C(C)=O)n1)N1CCC(CC1)N1CCN(C)CC1
Show InChI InChI=1S/C29H36ClN7O2/c1-20(38)23-6-4-5-7-25(23)32-28-24(30)19-31-29(34-28)33-26-9-8-22(18-27(26)39-3)36-12-10-21(11-13-36)37-16-14-35(2)15-17-37/h4-9,18-19,21H,10-17H2,1-3H3,(H2,31,32,33,34)
n/an/a 1.60n/an/an/an/an/an/a
ARIAD Pharmaceuticals, Inc.
Curated by ChEMBL
Assay Description
Inhibition of human ALK using poly[Glu:Tyr] (4:1) as substrate and [gamma-33P]ATP measured after 1 hr
J Med Chem 59: 4948-64 (2016)
BindingDB Entry DOI: 10.7270/Q2NK3H0Q
Insulin-like growth factor 1 receptor
(Homo sapiens (Human))
BDBM50185160
(CHEMBL3824301)
Show SMILES COc1cc(ccc1Nc1ncc(Cl)c(Nc2ccccc2C(C)=O)n1)N1CCC(CC1)N1CCN(C)CC1
Show InChI InChI=1S/C29H36ClN7O2/c1-20(38)23-6-4-5-7-25(23)32-28-24(30)19-31-29(34-28)33-26-9-8-22(18-27(26)39-3)36-12-10-21(11-13-36)37-16-14-35(2)15-17-37/h4-9,18-19,21H,10-17H2,1-3H3,(H2,31,32,33,34)
Reactome pathway
n/an/a 1.30n/an/an/an/an/an/a
ARIAD Pharmaceuticals, Inc.
Curated by ChEMBL
Assay Description
Inhibition of human IGF1R using KKKSPGEYVNIEFG as substrate and [gamma-33P]ATP measured after 1 hr
J Med Chem 59: 4948-64 (2016)
BindingDB Entry DOI: 10.7270/Q2NK3H0Q