BDBM50185239 CHEMBL3823296
SMILES: COc1cc(ccc1Nc1ncc(F)c(Nc2ccccc2P(C)(C)=O)n1)N1CCC(CC1)N1CCN(C)CC1
InChI Key: InChIKey=HBAGNJCIEGUKLI-UHFFFAOYSA-N
Data: 3 IC50
Activity Spreadsheet -- Enzyme Inhibition Constant Data from BindingDB
Found 3 hits for monomerid = 50185239
Trg + Lig
Ki
nM
ΔG°
kcal/mole
IC50
nM
Kd
nM
EC50/IC50
nM
koff
s-1
kon
M-1s-1
pHTemp
°C
Insulin receptor
(Homo sapiens (Human))
BDBM50185239
(CHEMBL3823296)
Show SMILES COc1cc(ccc1Nc1ncc(F)c(Nc2ccccc2P(C)(C)=O)n1)N1CCC(CC1)N1CCN(C)CC1
Show InChI InChI=1S/C29H39FN7O2P/c1-35-15-17-37(18-16-35)21-11-13-36(14-12-21)22-9-10-24(26(19-22)39-2)33-29-31-20-23(30)28(34-29)32-25-7-5-6-8-27(25)40(3,4)38/h5-10,19-21H,11-18H2,1-4H3,(H2,31,32,33,34)
n/an/a 1.68E+3n/an/an/an/an/an/a
ARIAD Pharmaceuticals, Inc.
Curated by ChEMBL
Assay Description
Inhibition of human InsR using myelin basic protein as substrate and [gamma-33P]ATP measured after 1 hr
J Med Chem 59: 4948-64 (2016)
BindingDB Entry DOI: 10.7270/Q2NK3H0Q
ALK tyrosine kinase receptor
(Homo sapiens (Human))
BDBM50185239
(CHEMBL3823296)
Show SMILES COc1cc(ccc1Nc1ncc(F)c(Nc2ccccc2P(C)(C)=O)n1)N1CCC(CC1)N1CCN(C)CC1
Show InChI InChI=1S/C29H39FN7O2P/c1-35-15-17-37(18-16-35)21-11-13-36(14-12-21)22-9-10-24(26(19-22)39-2)33-29-31-20-23(30)28(34-29)32-25-7-5-6-8-27(25)40(3,4)38/h5-10,19-21H,11-18H2,1-4H3,(H2,31,32,33,34)
n/an/a 0.390n/an/an/an/an/an/a
ARIAD Pharmaceuticals, Inc.
Curated by ChEMBL
Assay Description
Inhibition of human ALK using poly[Glu:Tyr] (4:1) as substrate and [gamma-33P]ATP measured after 1 hr
J Med Chem 59: 4948-64 (2016)
BindingDB Entry DOI: 10.7270/Q2NK3H0Q
Insulin-like growth factor 1 receptor
(Homo sapiens (Human))
BDBM50185239
(CHEMBL3823296)
Show SMILES COc1cc(ccc1Nc1ncc(F)c(Nc2ccccc2P(C)(C)=O)n1)N1CCC(CC1)N1CCN(C)CC1
Show InChI InChI=1S/C29H39FN7O2P/c1-35-15-17-37(18-16-35)21-11-13-36(14-12-21)22-9-10-24(26(19-22)39-2)33-29-31-20-23(30)28(34-29)32-25-7-5-6-8-27(25)40(3,4)38/h5-10,19-21H,11-18H2,1-4H3,(H2,31,32,33,34)
Reactome pathway
n/an/a 143n/an/an/an/an/an/a
ARIAD Pharmaceuticals, Inc.
Curated by ChEMBL
Assay Description
Inhibition of human IGF1R using KKKSPGEYVNIEFG as substrate and [gamma-33P]ATP measured after 1 hr
J Med Chem 59: 4948-64 (2016)
BindingDB Entry DOI: 10.7270/Q2NK3H0Q