BDBM50185251 2-(1-hydroxy-3,3-diphenyl-allyl)-3-methyl-3H-imidazol-1-ium::CHEMBL381386::GBR-12289
SMILES: [#6]-n1ccnc1-[#6](-[#8])\[#6]=[#6](/c1ccccc1)-c1ccccc1
InChI Key: InChIKey=ZNOUJOFQAABUAP-UHFFFAOYSA-N
Data: 1 IC50
Activity Spreadsheet -- Enzyme Inhibition Constant Data from BindingDB
Found 1 hit for monomerid = 50185251
Trg + Lig
Ki
nM
ΔG°
kcal/mole
IC50
nM
Kd
nM
EC50/IC50
nM
koff
s-1
kon
M-1s-1
pHTemp
°C
Cytochrome P450 2D6
(Homo sapiens (Human))
BDBM50185251
(2-(1-hydroxy-3,3-diphenyl-allyl)-3-methyl-3H-imida...)
Show SMILES [#6]-n1ccnc1-[#6](-[#8])\[#6]=[#6](/c1ccccc1)-c1ccccc1
Show InChI InChI=1S/C19H18N2O/c1-21-13-12-20-19(21)18(22)14-17(15-8-4-2-5-9-15)16-10-6-3-7-11-16/h2-14,18,22H,1H3
n/an/a 1.50E+4n/an/an/an/an/an/a
Vrije Universiteit
Curated by ChEMBL
Assay Description
Inhibition of human CYP2D6 expressed in Escherichia coli JM109
J Med Chem 49: 2417-30 (2006)
Article DOI: 10.1021/jm0508538
BindingDB Entry DOI: 10.7270/Q2930TZX