null
SMILES: COc1cc(ccc1Nc1ncc(Cl)c(Nc2ccccc2P(C)(C)=O)n1)N1CCN(CC1)C(C)=O
InChI Key: InChIKey=OGBBOXLWGHVVPQ-UHFFFAOYSA-N
Activity Spreadsheet -- Enzyme Inhibition Constant Data from BindingDB
Found 3 hits for monomerid = 50185279
Trg + Lig
Ki
nM
ΔG°
kcal/mole
IC50
nM
Kd
nM
EC50/IC50
nM
koff
s-1
kon
M-1s-1
pHTemp
°C
Insulin receptor
(Homo sapiens (Human))
BDBM50185279
(CHEMBL3824007)
Show SMILES COc1cc(ccc1Nc1ncc(Cl)c(Nc2ccccc2P(C)(C)=O)n1)N1CCN(CC1)C(C)=O
Show InChI InChI=1S/C25H30ClN6O3P/c1-17(33)31-11-13-32(14-12-31)18-9-10-20(22(15-18)35-2)29-25-27-16-19(26)24(30-25)28-21-7-5-6-8-23(21)36(3,4)34/h5-10,15-16H,11-14H2,1-4H3,(H2,27,28,29,30)
n/an/a 103n/an/an/an/an/an/a
ARIAD Pharmaceuticals, Inc.
Curated by ChEMBL
Assay Description
Inhibition of human InsR using myelin basic protein as substrate and [gamma-33P]ATP measured after 1 hr
J Med Chem 59: 4948-64 (2016)
BindingDB Entry DOI: 10.7270/Q2NK3H0Q
ALK tyrosine kinase receptor
(Homo sapiens (Human))
BDBM50185279
(CHEMBL3824007)
Show SMILES COc1cc(ccc1Nc1ncc(Cl)c(Nc2ccccc2P(C)(C)=O)n1)N1CCN(CC1)C(C)=O
Show InChI InChI=1S/C25H30ClN6O3P/c1-17(33)31-11-13-32(14-12-31)18-9-10-20(22(15-18)35-2)29-25-27-16-19(26)24(30-25)28-21-7-5-6-8-23(21)36(3,4)34/h5-10,15-16H,11-14H2,1-4H3,(H2,27,28,29,30)
n/an/a 0.590n/an/an/an/an/an/a
ARIAD Pharmaceuticals, Inc.
Curated by ChEMBL
Assay Description
Inhibition of human ALK using poly[Glu:Tyr] (4:1) as substrate and [gamma-33P]ATP measured after 1 hr
J Med Chem 59: 4948-64 (2016)
BindingDB Entry DOI: 10.7270/Q2NK3H0Q
Insulin-like growth factor 1 receptor
(Homo sapiens (Human))
BDBM50185279
(CHEMBL3824007)
Show SMILES COc1cc(ccc1Nc1ncc(Cl)c(Nc2ccccc2P(C)(C)=O)n1)N1CCN(CC1)C(C)=O
Show InChI InChI=1S/C25H30ClN6O3P/c1-17(33)31-11-13-32(14-12-31)18-9-10-20(22(15-18)35-2)29-25-27-16-19(26)24(30-25)28-21-7-5-6-8-23(21)36(3,4)34/h5-10,15-16H,11-14H2,1-4H3,(H2,27,28,29,30)
Reactome pathway
n/an/a 33n/an/an/an/an/an/a
ARIAD Pharmaceuticals, Inc.
Curated by ChEMBL
Assay Description
Inhibition of human IGF1R using KKKSPGEYVNIEFG as substrate and [gamma-33P]ATP measured after 1 hr
J Med Chem 59: 4948-64 (2016)
BindingDB Entry DOI: 10.7270/Q2NK3H0Q