BDBM50185464 3-(benzo[d][1,3]dioxol-5-yl)-4-(3-(2-(5,6,7,8-tetrahydro-1,8-naphthyridin-2-yl)ethoxy)isoxazol-5-yl)butanoic acid::CHEMBL210594
SMILES: OC(=O)CC(Cc1cc(OCCc2ccc3CCCNc3n2)no1)c1ccc2OCOc2c1
InChI Key: InChIKey=YGOKSIVHHLSPET-UHFFFAOYSA-N
Data: 4 IC50
Activity Spreadsheet -- Enzyme Inhibition Constant Data from BindingDB
Found 4 hits for monomerid = 50185464
Trg + Lig
Ki
nM
ΔG°
kcal/mole
IC50
nM
Kd
nM
EC50/IC50
nM
koff
s-1
kon
M-1s-1
pHTemp
°C
Integrin alpha-V/beta-5
(Homo sapiens (Human))
BDBM50185464
(3-(benzo[d][1,3]dioxol-5-yl)-4-(3-(2-(5,6,7,8-tetr...)
Show SMILES OC(=O)CC(Cc1cc(OCCc2ccc3CCCNc3n2)no1)c1ccc2OCOc2c1
Show InChI InChI=1S/C24H25N3O6/c28-23(29)12-17(16-4-6-20-21(11-16)32-14-31-20)10-19-13-22(27-33-19)30-9-7-18-5-3-15-2-1-8-25-24(15)26-18/h3-6,11,13,17H,1-2,7-10,12,14H2,(H,25,26)(H,28,29)
NCI pathway
Reactome pathway
n/an/a 1.20n/an/an/an/an/an/a
Pfizer Inc.
Curated by ChEMBL
Assay Description
Inhibition of alphavbeta5 integrin in 293 cells
Bioorg Med Chem Lett 16: 3156-61 (2006)
Article DOI: 10.1016/j.bmcl.2006.03.045
BindingDB Entry DOI: 10.7270/Q29023CB
Integrin alpha-V/beta-3
(Homo sapiens (Human))
BDBM50185464
(3-(benzo[d][1,3]dioxol-5-yl)-4-(3-(2-(5,6,7,8-tetr...)
Show SMILES OC(=O)CC(Cc1cc(OCCc2ccc3CCCNc3n2)no1)c1ccc2OCOc2c1
Show InChI InChI=1S/C24H25N3O6/c28-23(29)12-17(16-4-6-20-21(11-16)32-14-31-20)10-19-13-22(27-33-19)30-9-7-18-5-3-15-2-1-8-25-24(15)26-18/h3-6,11,13,17H,1-2,7-10,12,14H2,(H,25,26)(H,28,29)
n/an/a 0.340n/an/an/an/an/an/a
Pfizer Inc.
Curated by ChEMBL
Assay Description
Inhibition of alphavbeta3 integrin in 293 cells
Bioorg Med Chem Lett 16: 3156-61 (2006)
Article DOI: 10.1016/j.bmcl.2006.03.045
BindingDB Entry DOI: 10.7270/Q29023CB
Integrin alpha-V/beta-6
(Homo sapiens (Human))
BDBM50185464
(3-(benzo[d][1,3]dioxol-5-yl)-4-(3-(2-(5,6,7,8-tetr...)
Show SMILES OC(=O)CC(Cc1cc(OCCc2ccc3CCCNc3n2)no1)c1ccc2OCOc2c1
Show InChI InChI=1S/C24H25N3O6/c28-23(29)12-17(16-4-6-20-21(11-16)32-14-31-20)10-19-13-22(27-33-19)30-9-7-18-5-3-15-2-1-8-25-24(15)26-18/h3-6,11,13,17H,1-2,7-10,12,14H2,(H,25,26)(H,28,29)
n/an/a 350n/an/an/an/an/an/a
Pfizer Inc.
Curated by ChEMBL
Assay Description
Inhibition of alphavbeta6 integrin in HT29 cells
Bioorg Med Chem Lett 16: 3156-61 (2006)
Article DOI: 10.1016/j.bmcl.2006.03.045
BindingDB Entry DOI: 10.7270/Q29023CB
Integrin alpha-V/beta-3
(Homo sapiens (Human))
BDBM50185464
(3-(benzo[d][1,3]dioxol-5-yl)-4-(3-(2-(5,6,7,8-tetr...)
Show SMILES OC(=O)CC(Cc1cc(OCCc2ccc3CCCNc3n2)no1)c1ccc2OCOc2c1
Show InChI InChI=1S/C24H25N3O6/c28-23(29)12-17(16-4-6-20-21(11-16)32-14-31-20)10-19-13-22(27-33-19)30-9-7-18-5-3-15-2-1-8-25-24(15)26-18/h3-6,11,13,17H,1-2,7-10,12,14H2,(H,25,26)(H,28,29)
n/an/a 1n/an/an/an/an/an/a
Pfizer Inc.
Curated by ChEMBL
Assay Description
Inhibition of alphavbeta3 integrin by SPRA
Bioorg Med Chem Lett 16: 3156-61 (2006)
Article DOI: 10.1016/j.bmcl.2006.03.045
BindingDB Entry DOI: 10.7270/Q29023CB