BDBM50186222 CHEMBL3822500
SMILES: CC(C)OC(=O)N1CCC(CC1)n1ncc2cc(ncc12)-c1ccc(cc1)S(C)(=O)=O
InChI Key: InChIKey=WOWSNIZMNRMYES-UHFFFAOYSA-N
Data: 2 EC50
Activity Spreadsheet -- Enzyme Inhibition Constant Data from BindingDB
Found 2 hits for monomerid = 50186222
Trg + Lig
Ki
nM
ΔG°
kcal/mole
IC50
nM
Kd
nM
EC50/IC50
nM
koff
s-1
kon
M-1s-1
pHTemp
°C
Glucose-dependent insulinotropic receptor
(Homo sapiens (Human))
BDBM50186222
(CHEMBL3822500)
Show SMILES CC(C)OC(=O)N1CCC(CC1)n1ncc2cc(ncc12)-c1ccc(cc1)S(C)(=O)=O
Show InChI InChI=1S/C22H26N4O4S/c1-15(2)30-22(27)25-10-8-18(9-11-25)26-21-14-23-20(12-17(21)13-24-26)16-4-6-19(7-5-16)31(3,28)29/h4-7,12-15,18H,8-11H2,1-3H3
n/an/an/an/a 42n/an/an/an/a
Taisho Pharmaceutical Co., Ltd.
Curated by ChEMBL
Assay Description
Agonist activity at human GPR119 expressed in Flp-In-T-Rex-HEK293 cells assessed as stimulation of cAMP level measured after 30 mins by HTRF assay
Bioorg Med Chem 25: 4339-4354 (2017)
Article DOI: 10.1016/j.bmc.2017.06.014
BindingDB Entry DOI: 10.7270/Q21V5HFG
G-protein coupled receptor 119 (GPR119)
(Homo sapiens (Human))
BDBM50186222
(CHEMBL3822500)
Show SMILES CC(C)OC(=O)N1CCC(CC1)n1ncc2cc(ncc12)-c1ccc(cc1)S(C)(=O)=O
Show InChI InChI=1S/C22H26N4O4S/c1-15(2)30-22(27)25-10-8-18(9-11-25)26-21-14-23-20(12-17(21)13-24-26)16-4-6-19(7-5-16)31(3,28)29/h4-7,12-15,18H,8-11H2,1-3H3
n/an/an/an/a 42n/an/an/an/a
Taisho Pharmaceutical Co., Ltd
Curated by ChEMBL
Assay Description
Agonist activity at human GPR119 expressed in Flp-In-T-Rex-HEK293 cells after 30 mins by cAMP accumulation assay
Bioorg Med Chem Lett 26: 3441-6 (2016)
BindingDB Entry DOI: 10.7270/Q2XW4MRS