BDBM50186413 3-(4-(5-(3-cyano-4-cyclobutoxyphenyl)-1,3,4-thiadiazol-2-yl)-3-methylphenyl)propanoic acid::CHEMBL378970
SMILES: Cc1cc(CCC(O)=O)ccc1-c1nnc(s1)-c1ccc(OC2CCC2)c(c1)C#N
InChI Key: InChIKey=CAIHZPWGBKXDHE-UHFFFAOYSA-N
Data: 1 EC50
Activity Spreadsheet -- Enzyme Inhibition Constant Data from BindingDB
Found 1 hit for monomerid = 50186413
Trg + Lig
Ki
nM
ΔG°
kcal/mole
IC50
nM
Kd
nM
EC50/IC50
nM
koff
s-1
kon
M-1s-1
pHTemp
°C
Sphingosine 1-phosphate receptor 1
(Homo sapiens (Human))
BDBM50186413
(3-(4-(5-(3-cyano-4-cyclobutoxyphenyl)-1,3,4-thiadi...)
Show SMILES Cc1cc(CCC(O)=O)ccc1-c1nnc(s1)-c1ccc(OC2CCC2)c(c1)C#N
Show InChI InChI=1S/C23H21N3O3S/c1-14-11-15(6-10-21(27)28)5-8-19(14)23-26-25-22(30-23)16-7-9-20(17(12-16)13-24)29-18-3-2-4-18/h5,7-9,11-12,18H,2-4,6,10H2,1H3,(H,27,28)
Reactome pathway
n/an/an/an/a 0.790n/an/an/an/a
Merck & Co.
Curated by ChEMBL
Assay Description
Agonist activity at S1P1 receptor assessed as induction of [35S]GTPgammaS binding
Bioorg Med Chem Lett 16: 3684-7 (2006)
Article DOI: 10.1016/j.bmcl.2006.04.064
BindingDB Entry DOI: 10.7270/Q2HD7V7J