BDBM50186463 CHEMBL209009::N-(5-(3-(1-acetylpiperazine-4-carbonyl)-4-methylphenylthio)thiazol-2-yl)-4-(dimethylamino)benzamide
SMILES: CN(C)c1ccc(cc1)C(=O)Nc1ncc(Sc2ccc(C)c(c2)C(=O)N2CCN(CC2)C(C)=O)s1
InChI Key: InChIKey=MBQXWTBSEOBPNA-UHFFFAOYSA-N
Data: 1 IC50
Activity Spreadsheet -- Enzyme Inhibition Constant Data from BindingDB
Found 1 hit for monomerid = 50186463
Trg + Lig
Ki
nM
ΔG°
kcal/mole
IC50
nM
Kd
nM
EC50/IC50
nM
koff
s-1
kon
M-1s-1
pHTemp
°C
Tyrosine-protein kinase ITK/TSK
(Homo sapiens (Human))
BDBM50186463
(CHEMBL209009 | N-(5-(3-(1-acetylpiperazine-4-carbo...)
Show SMILES CN(C)c1ccc(cc1)C(=O)Nc1ncc(Sc2ccc(C)c(c2)C(=O)N2CCN(CC2)C(C)=O)s1
Show InChI InChI=1S/C26H29N5O3S2/c1-17-5-10-21(15-22(17)25(34)31-13-11-30(12-14-31)18(2)32)35-23-16-27-26(36-23)28-24(33)19-6-8-20(9-7-19)29(3)4/h5-10,15-16H,11-14H2,1-4H3,(H,27,28,33)
Reactome pathway
n/an/a 290n/an/an/an/an/an/a
Bristol-Myers Squibb Pharmaceutical Research Institute
Curated by ChEMBL
Assay Description
Inhibition of Itk
Bioorg Med Chem Lett 16: 3706-12 (2006)
Article DOI: 10.1016/j.bmcl.2006.04.060
BindingDB Entry DOI: 10.7270/Q20C4VBR