BDBM50186478 1-(4-(5-(2-(6-bromopyridin-2-ylamino)thiazol-5-ylthio)-2-hydroxybenzoyl)piperazin-1-yl)ethanone::CHEMBL210248
SMILES: CC(=O)N1CCN(CC1)C(=O)c1cc(Sc2cnc(Nc3cccc(Br)n3)s2)ccc1O
InChI Key: InChIKey=MBSUFDFTBSAUCT-UHFFFAOYSA-N
Data: 1 IC50
Activity Spreadsheet -- Enzyme Inhibition Constant Data from BindingDB
Found 1 hit for monomerid = 50186478
Trg + Lig
Ki
nM
ΔG°
kcal/mole
IC50
nM
Kd
nM
EC50/IC50
nM
koff
s-1
kon
M-1s-1
pHTemp
°C
Tyrosine-protein kinase ITK/TSK
(Homo sapiens (Human))
BDBM50186478
(1-(4-(5-(2-(6-bromopyridin-2-ylamino)thiazol-5-ylt...)
Show SMILES CC(=O)N1CCN(CC1)C(=O)c1cc(Sc2cnc(Nc3cccc(Br)n3)s2)ccc1O
Show InChI InChI=1S/C21H20BrN5O3S2/c1-13(28)26-7-9-27(10-8-26)20(30)15-11-14(5-6-16(15)29)31-19-12-23-21(32-19)25-18-4-2-3-17(22)24-18/h2-6,11-12,29H,7-10H2,1H3,(H,23,24,25)
Reactome pathway
n/an/a 7n/an/an/an/an/an/a
Bristol-Myers Squibb Pharmaceutical Research Institute
Curated by ChEMBL
Assay Description
Inhibition of Itk
Bioorg Med Chem Lett 16: 3706-12 (2006)
Article DOI: 10.1016/j.bmcl.2006.04.060
BindingDB Entry DOI: 10.7270/Q20C4VBR