BDBM50186483 CHEMBL211021::N-(5-((3-(1-acetylpiperazine-4-carbonyl)benzyloxy)methyl)thiazol-2-yl)-4-tert-butylbenzamide
SMILES: CC(=O)N1CCN(CC1)C(=O)c1cccc(COCc2cnc(NC(=O)c3ccc(cc3)C(C)(C)C)s2)c1
InChI Key: InChIKey=XIABTCSDBYIJTG-UHFFFAOYSA-N
Data: 1 IC50
Activity Spreadsheet -- Enzyme Inhibition Constant Data from BindingDB
Found 1 hit for monomerid = 50186483
Trg + Lig
Ki
nM
ΔG°
kcal/mole
IC50
nM
Kd
nM
EC50/IC50
nM
koff
s-1
kon
M-1s-1
pHTemp
°C
Tyrosine-protein kinase ITK/TSK
(Homo sapiens (Human))
BDBM50186483
(CHEMBL211021 | N-(5-((3-(1-acetylpiperazine-4-carb...)
Show SMILES CC(=O)N1CCN(CC1)C(=O)c1cccc(COCc2cnc(NC(=O)c3ccc(cc3)C(C)(C)C)s2)c1
Show InChI InChI=1S/C29H34N4O4S/c1-20(34)32-12-14-33(15-13-32)27(36)23-7-5-6-21(16-23)18-37-19-25-17-30-28(38-25)31-26(35)22-8-10-24(11-9-22)29(2,3)4/h5-11,16-17H,12-15,18-19H2,1-4H3,(H,30,31,35)
Reactome pathway
n/an/a 930n/an/an/an/an/an/a
Bristol-Myers Squibb Pharmaceutical Research Institute
Curated by ChEMBL
Assay Description
Inhibition of Itk
Bioorg Med Chem Lett 16: 3706-12 (2006)
Article DOI: 10.1016/j.bmcl.2006.04.060
BindingDB Entry DOI: 10.7270/Q20C4VBR