BDBM50186949 1-(2,3-dimethyl-5-oxo-1-phenyl-2,5-dihydro-1H-pyrazol-4-yl)-3-p-tolylurea::CHEMBL450023
SMILES: Cc1c(NC(=O)Nc2ccc(C)cc2)c(=O)n(-c2ccccc2)n1C
InChI Key: InChIKey=ZWLWHRUIMHFTBQ-UHFFFAOYSA-N
Data: 1 EC50
Activity Spreadsheet -- Enzyme Inhibition Constant Data from BindingDB
Found 1 hit for monomerid = 50186949
Trg + Lig
Ki
nM
ΔG°
kcal/mole
IC50
nM
Kd
nM
EC50/IC50
nM
koff
s-1
kon
M-1s-1
pHTemp
°C
N-formyl peptide receptor 2
(Homo sapiens (Human))
BDBM50186949
(1-(2,3-dimethyl-5-oxo-1-phenyl-2,5-dihydro-1H-pyra...)
Show SMILES Cc1c(NC(=O)Nc2ccc(C)cc2)c(=O)n(-c2ccccc2)n1C
Show InChI InChI=1S/C19H20N4O2/c1-13-9-11-15(12-10-13)20-19(25)21-17-14(2)22(3)23(18(17)24)16-7-5-4-6-8-16/h4-12H,1-3H3,(H2,20,21,25)
NCI pathway
Reactome pathway
n/an/an/an/a 1.26E+3n/an/an/an/a
Amgen, Inc.
Curated by ChEMBL
Assay Description
Activity at human FPRL1-mediated calcium mobilization in CHO cells
Bioorg Med Chem Lett 16: 3713-8 (2006)
Article DOI: 10.1016/j.bmcl.2006.04.068
BindingDB Entry DOI: 10.7270/Q2DF6QTJ