BDBM50186999 3-(2-(furan-2-ylmethylamino)-3,4-dioxocyclobut-1-enylamino)-2-hydroxy-N,N-dimethylbenzamide::CHEMBL211609
SMILES: CN(C)C(=O)c1cccc(Nc2c(NCc3ccco3)c(=O)c2=O)c1O
InChI Key: InChIKey=KMXFUUOISCOKES-UHFFFAOYSA-N
Data: 1 IC50
Activity Spreadsheet -- Enzyme Inhibition Constant Data from BindingDB
Found 1 hit for monomerid = 50186999
Trg + Lig
Ki
nM
ΔG°
kcal/mole
IC50
nM
Kd
nM
EC50/IC50
nM
koff
s-1
kon
M-1s-1
pHTemp
°C
C-X-C chemokine receptor type 2
(Homo sapiens (Human))
BDBM50186999
(3-(2-(furan-2-ylmethylamino)-3,4-dioxocyclobut-1-e...)
Show SMILES CN(C)C(=O)c1cccc(Nc2c(NCc3ccco3)c(=O)c2=O)c1O
Show InChI InChI=1S/C18H17N3O5/c1-21(2)18(25)11-6-3-7-12(15(11)22)20-14-13(16(23)17(14)24)19-9-10-5-4-8-26-10/h3-8,19-20,22H,9H2,1-2H3
Reactome pathway
n/an/a 41n/an/an/an/an/an/a
Pharmacopeia Drug Discovery, Inc.
Curated by ChEMBL
Assay Description
Displacement of [125I]IL8 from human CXCR2 expressed in CHO cells
Bioorg Med Chem Lett 16: 4107-10 (2006)
Article DOI: 10.1016/j.bmcl.2006.04.082
BindingDB Entry DOI: 10.7270/Q24X57DB