BDBM50187077 (E)-N-(2-aminophenyl)-3-(4-((4-methoxyphenylamino)methyl)phenyl)acrylamide::CHEMBL209762::N-(2-aminophenyl)-3-(4-((4-methoxyphenylamino)methyl)phenyl)acrylamide
SMILES: COc1ccc(NCc2ccc(\C=C\C(=O)Nc3ccccc3N)cc2)cc1
InChI Key: InChIKey=VTBPJARWNUWZDU-XNTDXEJSSA-N
Data: 2 IC50
Activity Spreadsheet -- Enzyme Inhibition Constant Data from BindingDB
Found 2 hits for monomerid = 50187077
Trg + Lig
Ki
nM
ΔG°
kcal/mole
IC50
nM
Kd
nM
EC50/IC50
nM
koff
s-1
kon
M-1s-1
pHTemp
°C
Histone deacetylase 1
(Homo sapiens (Human))
BDBM50187077
((E)-N-(2-aminophenyl)-3-(4-((4-methoxyphenylamino)...)
Show SMILES COc1ccc(NCc2ccc(\C=C\C(=O)Nc3ccccc3N)cc2)cc1
Show InChI InChI=1S/C23H23N3O2/c1-28-20-13-11-19(12-14-20)25-16-18-8-6-17(7-9-18)10-15-23(27)26-22-5-3-2-4-21(22)24/h2-15,25H,16,24H2,1H3,(H,26,27)/b15-10+
NCI pathway
Reactome pathway
n/an/a 4.00E+3n/an/an/an/an/an/a
Menarini Ricerche
Curated by ChEMBL
Assay Description
Inhibition of HDAC1
J Med Chem 51: 1505-29 (2008)
Article DOI: 10.1021/jm7011408
BindingDB Entry DOI: 10.7270/Q2M32WMT
Histone deacetylase 1
(Homo sapiens (Human))
BDBM50187077
((E)-N-(2-aminophenyl)-3-(4-((4-methoxyphenylamino)...)
Show SMILES COc1ccc(NCc2ccc(\C=C\C(=O)Nc3ccccc3N)cc2)cc1
Show InChI InChI=1S/C23H23N3O2/c1-28-20-13-11-19(12-14-20)25-16-18-8-6-17(7-9-18)10-15-23(27)26-22-5-3-2-4-21(22)24/h2-15,25H,16,24H2,1H3,(H,26,27)/b15-10+
NCI pathway
Reactome pathway
n/an/a 4.00E+3n/an/an/an/an/an/a
MethylGene Inc.
Curated by ChEMBL
Assay Description
Inhibition of human recombinant HDAC1
Bioorg Med Chem Lett 16: 4048-52 (2006)
Article DOI: 10.1016/j.bmcl.2006.05.005
BindingDB Entry DOI: 10.7270/Q2CF9PP5