BDBM50187221 (4S)-3-[(3,5-dichloro-2-hydroxyphenyl)sulfonyl]-1,3-thiazolidine-4-carboxylic acid::CHEMBL207911
SMILES: OC(=O)[C@@H]1CSCN1S(=O)(=O)c1cc(Cl)cc(Cl)c1O
InChI Key: InChIKey=RBQJYPYYMZHKHT-ZETCQYMHSA-N
Data: 1 IC50
Activity Spreadsheet -- Enzyme Inhibition Constant Data from BindingDB
Found 1 hit for monomerid = 50187221
Trg + Lig
Ki
nM
ΔG°
kcal/mole
IC50
nM
Kd
nM
EC50/IC50
nM
koff
s-1
kon
M-1s-1
pHTemp
°C
Hepatitis C virus NS5B RNA-dependent RNA polymerase
(Hepatitis C virus)
BDBM50187221
((4S)-3-[(3,5-dichloro-2-hydroxyphenyl)sulfonyl]-1,...)
Show SMILES OC(=O)[C@@H]1CSCN1S(=O)(=O)c1cc(Cl)cc(Cl)c1O
Show InChI InChI=1S/C10H9Cl2NO5S2/c11-5-1-6(12)9(14)8(2-5)20(17,18)13-4-19-3-7(13)10(15)16/h1-2,7,14H,3-4H2,(H,15,16)/t7-/m0/s1
n/an/a 240n/an/an/an/an/an/a
Wyeth Research
Curated by ChEMBL
Assay Description
Inhibition of HCV NS5B RNA dependent RNA polymerase
J Med Chem 49: 3052-5 (2006)
Article DOI: 10.1021/jm060168g
BindingDB Entry DOI: 10.7270/Q2M04517