BDBM50187358 (5-Benzyloxy-1H-indol-2-yl)-(5-fluoro-1H-indol-2-yl)-methanone::CHEMBL206469
SMILES: Fc1ccc2[nH]c(cc2c1)C(=O)c1cc2cc(OCc3ccccc3)ccc2[nH]1
InChI Key: InChIKey=NELMVDCGAWGQEN-UHFFFAOYSA-N
Data: 2 IC50
Activity Spreadsheet -- Enzyme Inhibition Constant Data from BindingDB
Found 2 hits for monomerid = 50187358
Trg + Lig
Ki
nM
ΔG°
kcal/mole
IC50
nM
Kd
nM
EC50/IC50
nM
koff
s-1
kon
M-1s-1
pHTemp
°C
PDGFR-beta/Platelet-derived growth factor receptor alpha
(Mus musculus (mouse))
BDBM50187358
((5-Benzyloxy-1H-indol-2-yl)-(5-fluoro-1H-indol-2-y...)
Show SMILES Fc1ccc2[nH]c(cc2c1)C(=O)c1cc2cc(OCc3ccccc3)ccc2[nH]1
Show InChI InChI=1S/C24H17FN2O2/c25-18-6-8-20-16(10-18)12-22(26-20)24(28)23-13-17-11-19(7-9-21(17)27-23)29-14-15-4-2-1-3-5-15/h1-13,26-27H,14H2
n/an/a 5.80E+3n/an/an/an/an/an/a
University of Regensburg
Curated by ChEMBL
Assay Description
Inhibition of endogenous PDGFR in Swiss3T3 fibroblasts
J Med Chem 49: 3101-15 (2006)
Article DOI: 10.1021/jm058033i
BindingDB Entry DOI: 10.7270/Q26T0M7B
Receptor-type tyrosine-protein kinase FLT3
(Homo sapiens (Human))
BDBM50187358
((5-Benzyloxy-1H-indol-2-yl)-(5-fluoro-1H-indol-2-y...)
Show SMILES Fc1ccc2[nH]c(cc2c1)C(=O)c1cc2cc(OCc3ccccc3)ccc2[nH]1
Show InChI InChI=1S/C24H17FN2O2/c25-18-6-8-20-16(10-18)12-22(26-20)24(28)23-13-17-11-19(7-9-21(17)27-23)29-14-15-4-2-1-3-5-15/h1-13,26-27H,14H2
n/an/a>3.00E+4n/an/an/an/an/an/a
University of Regensburg
Curated by ChEMBL
Assay Description
Inhibition of endogenous FLT3 in EOL1 cells
J Med Chem 49: 3101-15 (2006)
Article DOI: 10.1021/jm058033i
BindingDB Entry DOI: 10.7270/Q26T0M7B