BDBM50187439 1-(5-Methoxypyridin-3-yl)-[1,5]diazocane::1-(5-methoxypyridin-3-yl)-1,5-diazocane::CHEMBL378630
SMILES: COc1cncc(c1)N1CCCNCCC1
InChI Key: InChIKey=SHALYUZFJLUFSL-UHFFFAOYSA-N
Data: 2 IC50  1 EC50
Activity Spreadsheet -- Enzyme Inhibition Constant Data from BindingDB
Found 3 hits for monomerid = 50187439
Trg + Lig
Ki
nM
ΔG°
kcal/mole
IC50
nM
Kd
nM
EC50/IC50
nM
koff
s-1
kon
M-1s-1
pHTemp
°C
Neuronal acetylcholine receptor subunit alpha-4
(Homo sapiens (Human))
BDBM50187439
(1-(5-Methoxypyridin-3-yl)-[1,5]diazocane | 1-(5-me...)
Show SMILES COc1cncc(c1)N1CCCNCCC1
Show InChI InChI=1S/C12H19N3O/c1-16-12-8-11(9-14-10-12)15-6-2-4-13-5-3-7-15/h8-10,13H,2-7H2,1H3
n/an/a 1n/an/an/an/an/an/a
University of Turin
Curated by ChEMBL
Assay Description
Displacement of [3H]cytisine from human alpha4beta2 nAChR expressed in HEK293 cells
J Med Chem 52: 2311-6 (2009)
Article DOI: 10.1021/jm801060h
BindingDB Entry DOI: 10.7270/Q2XK8GS0
Neuronal acetylcholine receptor protein alpha-4/beta-2 subunit
(Rattus norvegicus (Rat))
BDBM50187439
(1-(5-Methoxypyridin-3-yl)-[1,5]diazocane | 1-(5-me...)
Show SMILES COc1cncc(c1)N1CCCNCCC1
Show InChI InChI=1S/C12H19N3O/c1-16-12-8-11(9-14-10-12)15-6-2-4-13-5-3-7-15/h8-10,13H,2-7H2,1H3
n/an/a 1n/an/an/an/an/an/a
NeuroSearch A/S
Curated by ChEMBL
Assay Description
Inhibition of [3H]cytisine binding to alpha4beta2 nACHR in Wistar rat cerebral cortical membrane
J Med Chem 49: 3159-71 (2006)
Article DOI: 10.1021/jm058058h
BindingDB Entry DOI: 10.7270/Q2C53PM7
Neuronal acetylcholine receptor subunit alpha-4
(Homo sapiens (Human))
BDBM50187439
(1-(5-Methoxypyridin-3-yl)-[1,5]diazocane | 1-(5-me...)
Show SMILES COc1cncc(c1)N1CCCNCCC1
Show InChI InChI=1S/C12H19N3O/c1-16-12-8-11(9-14-10-12)15-6-2-4-13-5-3-7-15/h8-10,13H,2-7H2,1H3
n/an/an/an/a 120n/an/an/an/a
University of Turin
Curated by ChEMBL
Assay Description
Agonist activity at human alpha4beta2 nAChR expressed in HEK293 cells assessed as intracellular calcium level by FLIPR assay
J Med Chem 52: 2311-6 (2009)
Article DOI: 10.1021/jm801060h
BindingDB Entry DOI: 10.7270/Q2XK8GS0