BDBM50187696 CHEMBL3621356
SMILES: CCCCCCCCCCCCCCCC(=O)OC[C@@H](O)C[C@H](Br)P(O)(O)=O
InChI Key: InChIKey=HLVKVWDSLLFMSX-RBUKOAKNSA-N
Data: 2 IC50
Activity Spreadsheet -- Enzyme Inhibition Constant Data from BindingDB
Found 2 hits for monomerid = 50187696
Trg + Lig
Ki
nM
ΔG°
kcal/mole
IC50
nM
Kd
nM
EC50/IC50
nM
koff
s-1
kon
M-1s-1
pHTemp
°C
Ectonucleotide pyrophosphatase/phosphodiesterase family member 2
(Homo sapiens (Human))
BDBM50187696
(CHEMBL3621356)
Show SMILES CCCCCCCCCCCCCCCC(=O)OC[C@@H](O)C[C@H](Br)P(O)(O)=O |r|
Show InChI InChI=1S/C20H40BrO6P/c1-2-3-4-5-6-7-8-9-10-11-12-13-14-15-20(23)27-17-18(22)16-19(21)28(24,25)26/h18-19,22H,2-17H2,1H3,(H2,24,25,26)/t18-,19+/m0/s1
n/an/a 22n/an/an/an/an/an/a
University of Strathclyde
Curated by ChEMBL
Assay Description
Inhibition of recombinant HA-tagged ATX (unknown origin) using FS-3 as substrate measured after 2 hrs by fluorescence assay
J Med Chem 60: 722-748 (2017)
BindingDB Entry DOI: 10.7270/Q2MW2KCW
Ectonucleotide pyrophosphatase/phosphodiesterase family member 2
(Homo sapiens (Human))
BDBM50187696
(CHEMBL3621356)
Show SMILES CCCCCCCCCCCCCCCC(=O)OC[C@@H](O)C[C@H](Br)P(O)(O)=O |r|
Show InChI InChI=1S/C20H40BrO6P/c1-2-3-4-5-6-7-8-9-10-11-12-13-14-15-20(23)27-17-18(22)16-19(21)28(24,25)26/h18-19,22H,2-17H2,1H3,(H2,24,25,26)/t18-,19+/m0/s1
n/an/a 22n/an/an/an/an/an/a
University of Strathclyde
Curated by ChEMBL
Assay Description
Inhibition of recombinant hemagglutinin-tagged ATX (unknown origin) using FS3 as substrate incubated for 2 hrs by fluorescence plate reader analysis
J Med Chem 59: 5604-21 (2016)
BindingDB Entry DOI: 10.7270/Q2BZ681D