null
SMILES: NC(=N)c1ccc2[nH]c(cc2c1)-c1cc(ccc1O)-c1cccs1
InChI Key: InChIKey=XIVYNVGOIKNHQT-UHFFFAOYSA-N
Activity Spreadsheet -- Enzyme Inhibition Constant Data from BindingDB
Found 1 hit for monomerid = 50187712
Trg + Lig
Ki
nM
ΔG°
kcal/mole
IC50
nM
Kd
nM
EC50/IC50
nM
koff
s-1
kon
M-1s-1
pHTemp
°C
Serine protease hepsin
(Homo sapiens (Human))
BDBM50187712
(CHEMBL3828185)
Show SMILES NC(=N)c1ccc2[nH]c(cc2c1)-c1cc(ccc1O)-c1cccs1
Show InChI InChI=1S/C19H15N3OS/c20-19(21)12-3-5-15-13(8-12)10-16(22-15)14-9-11(4-6-17(14)23)18-2-1-7-24-18/h1-10,22-23H,(H3,20,21)
n/an/a 7.00E+4n/an/an/an/an/an/a
Korea University
Curated by ChEMBL
Assay Description
Inhibition of recombinant human hepsin using Boc-QAR-AMC as substrate preincubated for 30 mins followed by substrate addition by fluorescence assay
Eur J Med Chem 118: 208-218 (2016)
Article DOI: 10.1016/j.ejmech.2016.04.033
BindingDB Entry DOI: 10.7270/Q2TX3HB6