BDBM50187799 4-((4-(but-2-ynyloxy)phenylsulfonyl)methyl)-1-(cyclohexanecarbonyl)-N-hydroxypiperidine-4-carboxamide::CHEMBL212469
SMILES: CC#CCOc1ccc(cc1)S(=O)(=O)CC1(CCN(CC1)C(=O)C1CCCCC1)C(=O)NO
InChI Key: InChIKey=HUBYDVFNYBGAGD-UHFFFAOYSA-N
Data: 1 IC50
Activity Spreadsheet -- Enzyme Inhibition Constant Data from BindingDB
Found 1 hit for monomerid = 50187799
Trg + Lig
Ki
nM
ΔG°
kcal/mole
IC50
nM
Kd
nM
EC50/IC50
nM
koff
s-1
kon
M-1s-1
pHTemp
°C
Disintegrin and metalloproteinase domain-containing protein 17
(Homo sapiens (Human))
BDBM50187799
(4-((4-(but-2-ynyloxy)phenylsulfonyl)methyl)-1-(cyc...)
Show SMILES CC#CCOc1ccc(cc1)S(=O)(=O)CC1(CCN(CC1)C(=O)C1CCCCC1)C(=O)NO
Show InChI InChI=1S/C24H32N2O6S/c1-2-3-17-32-20-9-11-21(12-10-20)33(30,31)18-24(23(28)25-29)13-15-26(16-14-24)22(27)19-7-5-4-6-8-19/h9-12,19,29H,4-8,13-18H2,1H3,(H,25,28)
Reactome pathway
n/an/a 2.30n/an/an/an/an/an/a
Wyeth Research
Curated by ChEMBL
Assay Description
Inhibition of TACE by FRET assay
Bioorg Med Chem Lett 16: 3927-31 (2006)
Article DOI: 10.1016/j.bmcl.2006.05.026
BindingDB Entry DOI: 10.7270/Q2222TCJ